program: Gaussian 09
title: 000243927
version: EM64L-G09RevD.01
frameworkgroup: C1[X(C15H13NO5)]
method: RPBEPBE
basis: SDD
operation: Freq
keyword: #p
keyword: freq=noraman
keyword: PBEPBE/SDD
title: #p freq=noraman PBEPBE/SDD
converged: YES YES NO NO
title: Mulliken charges:
elementType: O O O O O N C C C C C C C C C C C C C C C H H H H H H H H H H H H H
charge: -0.281346 -0.425470 -0.161253 -0.189676 -0.237730 0.042456 0.117486 0.353644 0.183869 0.170588 -0.457670 -0.373018 -0.379351 0.500960 -0.811250 -0.430707 -0.367316 0.124305 -0.223102 -0.222152 -0.231029 0.206478 0.246802 0.246954 0.280387 0.267278 0.235751 0.235657 0.226713 0.267973 0.227304 0.230365 0.230346 0.395752
chargesum: 0.00000
title: Mulliken charges with hydrogens summed into heavy atoms:
elementType: O O O O O N C C C C C C C C C C C C C C C
charge: -0.281346 -0.029718 -0.161253 -0.189676 -0.237730 0.042456 0.117486 0.353644 0.183869 0.170588 -0.004390 -0.126064 -0.098964 0.500960 -0.072564 -0.203994 -0.099342 0.124305 0.004202 0.008214 -0.000683
polarizability: 2.67590757e+02 9.93450321e-01 2.11017325e+02 5.15778144e+00 -5.62119760e+00 9.78068398e+01
1716.lowfreq: -10.6724 -3.9841 -0.0009 -0.0007 0.0002 5.8056 21.0982 32.1522 35.9508
frequency: 20.7934 32.1311 35.8850 40.3053 70.2881 94.6761 102.4494 113.2817 118.9514 133.8679 167.9492 187.7866 206.2693 249.3153 284.2038 300.3416 309.4773 332.8316 357.5261 390.2342 404.0215 415.9771 472.9193 506.7285 533.4010 539.6321 568.5347 594.5570 614.5645 617.3288 638.5000 657.6059 698.9328 705.6057 722.6419 746.0479 752.2472 776.5908 823.3501 840.7592 856.2933 857.6985 890.6652 930.0005 949.5077 968.8708 981.6068 982.7324 990.7199 1000.2960 1000.8804 1026.7673 1045.7221 1049.9036 1089.6605 1146.4044 1167.8414 1173.3624 1189.0257 1190.4152 1199.9614 1230.4610 1249.3620 1259.4675 1320.3625 1328.4992 1346.0419 1370.2526 1384.7075 1388.6878 1395.6487 1399.6515 1442.3490 1458.7226 1471.8657 1480.3300 1483.2457 1486.7242 1561.4824 1595.7348 1604.3349 1616.5373 1639.5074 2979.8425 2991.4430 3058.4296 3064.6300 3102.2911 3117.2008 3127.8207 3138.1723 3141.6785 3150.0625 3165.2263 3171.3734 3538.8272
redmass: 5.2032 5.7371 6.5138 7.9375 4.6500 6.2587 3.2862 3.8906 1.2688 6.3196 10.2289 5.9647 6.5204 4.8198 3.8314 5.0868 5.7650 2.6969 7.2413 5.0129 2.8169 6.0568 3.8396 4.6762 6.2204 2.2324 5.0726 2.2008 3.5258 5.8001 5.1483 6.0457 4.8418 1.9545 6.4053 8.3458 2.3847 3.9146 5.6291 2.9556 1.4189 1.4131 6.1345 1.4600 4.7669 1.6550 1.3862 1.3638 6.1539 1.9329 1.3348 2.1913 1.9787 1.8074 1.5238 3.3869 1.6742 1.0565 1.1042 1.1206 2.0590 2.5248 6.2600 2.6040 2.4031 1.3010 1.8539 6.6741 3.3680 3.5507 1.9628 3.5845 2.1844 1.1217 1.1174 2.4106 1.2480 2.3635 6.0566 6.1037 7.4637 6.1026 9.4139 1.0404 1.0568 1.1077 1.0929 1.1006 1.0874 1.0868 1.0918 1.0896 1.0965 1.1016 1.0957 1.0645
irintensity: 0.2691 0.1588 0.9075 2.1844 0.4481 1.4217 0.1191 2.1532 0.9912 1.1744 3.5769 0.2484 0.8464 0.4059 3.2649 1.2284 1.4921 0.6791 6.6931 8.1954 0.5328 7.1915 10.8426 9.8578 15.6999 32.7567 11.6305 60.3081 46.0489 5.0534 11.5654 4.5754 18.6760 42.6413 40.3115 14.8894 86.1644 3.8531 47.8564 4.2727 19.2024 11.8590 54.0915 1.3876 79.3519 2.5809 0.0717 3.5669 0.2101 41.4861 0.8863 4.9740 156.1954 95.3546 8.4682 44.8433 13.7491 0.0963 6.9828 3.0895 100.9301 20.9854 129.4406 16.5031 136.2276 7.3243 35.3819 18.8344 1.4911 5.9538 99.9015 111.6852 10.4023 16.4993 12.0407 13.7715 24.3219 6.7230 57.5774 1.0026 25.9060 0.2882 310.0780 10.8796 39.0742 13.5901 14.0067 8.8241 7.9792 0.6803 13.1144 9.4235 27.9432 27.0059 2.9772 60.5851
temp: 298.150 k
press: 1.00000 atm
elementType: 8 8 8 8 8 7 6 6 6 6 6 6 6 6 6 6 6 6 6 6 6 1 1 1 1 1 1 1 1 1 1 1 1 1
symmnumber: 1
zpe: 658710.6 jmol-1
zpe.correction: 0.250890 hartree
zpe.thermalcorrener: 0.270128 hartree
zpe.thermalcorrenthalpy: 0.271072 hartree
zpe.thermalcorrgfe: 0.200831 hartree
zpe.sumelectzpe: -1008.673449 hartree
zpe.sumelectthermal: -1008.654210 hartree
zpe.sumelectthermalent: -1008.653266 hartree
zpe.sumelectthermalfe: -1008.723507 hartree
dipole: 1.4243 3.9914 -1.9466
dipole: 4.6636
quadrupole: -116.7872 -104.0586 -127.1019
quadrupole: 0.5577 4.6492 0.5307
quadrupole: -0.8047 11.9240 -11.1193 0.5577 4.6492 0.5307
hfenergy: -1008.9243383 hartree
pointgroup: C01 [X(C15H13N1O5)]
dipole: 0.5743366 1.5873145 -0.7190686 debye
polarizability: 267.5825825|0.3957882|211.2379488|5.454946|-2.374558|97.5943908 unknown
InChI: InChI=1S/C15H13NO5/c1-10-7-8-12(15(17)18)13(16(19)20)14(10)21-9-11-5-3-2-4-6-11/h2-8,17H,9H2,1H3
charge 0 multiplicity 1
34 atoms
O  0.711545 0.626444 0.360912
O  -3.526516 -2.109517 -0.678669
O  -1.298326 -2.159527 1.197438
O  -0.288128 -1.892012 -0.829666
O  -5.259181 -0.695298 -0.052618
N  -1.033092 -1.48644 0.140263
C  -0.639186 0.945759 0.141722
C  -1.080239 2.299965 0.154271
C  -1.583847 -0.106302 0.04314
C  -2.974266 0.146843 -0.066591
C  1.596324 0.660364 -0.868944
C  -2.471698 2.548757 0.058859
C  -3.400535 1.498461 -0.055216
C  2.941907 0.105923 -0.479016
C  -0.081182 3.426302 0.308515
C  4.057274 0.963937 -0.315171
C  3.101069 -1.288851 -0.271173
C  -4.034831 -0.889862 -0.235265
C  5.318056 0.43976 0.049957
C  4.35809 -1.81247 0.099297
C  5.469495 -0.950257 0.258896
H  1.673266 1.708113 -1.217045
H  1.100139 0.042009 -1.638752
H  -2.828222 3.584346 0.08045
H  -4.473916 1.695099 -0.133948
H  0.789977 3.09465 0.898175
H  0.291857 3.76926 -0.67632
H  -0.541126 4.296671 0.805755
H  3.938862 2.043576 -0.471744
H  2.237269 -1.952263 -0.395076
H  6.176054 1.110039 0.172431
H  4.473712 -2.889857 0.260936
H  6.445614 -1.359408 0.543059
H  -4.259118 -2.777512 -0.751862
