program: Gaussian 09
title: 000243921
version: EM64L-G09RevD.01
frameworkgroup: C1[X(C11H11NO6S2)]
method: RPBEPBE
basis: SDD
operation: Freq
keyword: #p
keyword: freq=noraman
keyword: PBEPBE/SDD
title: #p freq=noraman PBEPBE/SDD
converged: YES YES NO NO
title: Mulliken charges:
elementType: S S O O O O O O N C C C C C C C C C C C H H H H H H H H H H H
charge: 0.230811 0.258982 -0.429184 -0.429855 -0.206237 -0.204207 -0.211620 -0.212950 0.027826 -1.000684 0.618524 -0.416800 -0.295448 -0.348311 -0.355828 0.375890 -0.724052 -0.720281 0.276310 0.283857 0.412489 0.268407 0.267231 0.288776 0.288474 0.293902 0.293617 0.301230 0.295832 0.387213 0.386086
chargesum: 0.00000
title: Mulliken charges with hydrogens summed into heavy atoms:
elementType: S S O O O O O O N C C C C C C C C C C C
charge: 0.230811 0.258982 -0.041971 -0.043769 -0.206237 -0.204207 -0.211620 -0.212950 0.027826 -0.588195 0.618524 -0.148394 -0.028217 -0.059535 -0.067355 0.375890 -0.136533 -0.123219 0.276310 0.283857
polarizability: 2.64718916e+02 -7.32818505e-02 1.63610826e+02 -4.84141496e+00 1.36797304e+01 1.61554888e+02
1716.lowfreq: -6.9723 -0.0006 -0.0004 0.0020 3.6341 5.2311 20.7282 23.7056 27.6566
frequency: 20.5858 23.5741 27.6024 41.2774 49.5778 52.5789 66.7998 70.3339 79.1440 113.6405 119.9213 145.0258 168.4188 188.9996 207.6735 218.9896 263.1556 317.0459 323.7381 394.0841 399.9551 406.2456 420.3144 492.5248 503.3681 504.4097 507.5703 563.8971 572.6968 614.7777 633.8720 634.8251 642.2636 649.3550 672.7325 704.8619 730.6949 732.8275 756.0674 769.8696 824.5762 832.5776 836.0655 852.3168 872.8804 883.5527 899.0403 989.8369 996.5956 1005.4406 1049.4621 1067.5195 1091.3660 1109.0346 1169.4422 1178.1482 1181.9946 1193.1843 1215.8264 1220.6592 1228.2534 1240.5544 1252.3100 1299.0059 1304.2016 1309.2284 1368.3158 1403.4234 1420.4268 1424.6865 1427.5002 1478.0728 1594.4018 1605.6345 1671.4907 1674.8443 3044.5296 3057.2586 3082.8768 3145.3955 3146.1037 3148.2949 3151.1349 3183.3826 3186.0077 3511.2130 3519.7697
redmass: 7.7933 9.1851 8.4457 8.5595 8.8489 7.7713 7.4079 8.1744 6.5011 5.3622 7.9108 6.5166 8.3604 10.3553 7.9161 8.1432 7.7999 7.1629 7.1961 2.9198 2.3380 2.8867 5.3164 3.9698 7.7120 4.5405 4.2569 2.4134 2.3829 6.2220 2.9295 3.1778 4.6853 2.0003 4.2563 5.2062 5.9830 6.2859 4.6319 8.4273 5.0302 5.2655 5.6618 1.2574 1.7180 1.9501 2.0007 1.3382 1.3816 3.0345 1.8572 1.7814 3.2463 1.3262 1.1852 1.2146 1.3376 1.2388 1.7346 4.4545 1.1871 1.2434 1.6357 2.0901 1.9915 1.4157 7.0417 7.5247 2.4236 1.1427 1.1973 2.4272 7.6133 6.2822 8.6772 8.6012 1.0611 1.0586 1.0873 1.1046 1.1070 1.0908 1.0908 1.0947 1.0957 1.0640 1.0640
irintensity: 0.0503 0.7011 0.3477 0.9653 1.6493 2.1037 0.5551 1.0273 1.1518 0.1737 1.7381 1.4683 0.9729 5.6958 3.4561 1.1242 0.7124 0.1346 0.8681 9.3555 5.5610 0.2871 6.7880 4.9824 2.3166 17.1411 40.3126 40.4792 39.0239 8.6997 87.4871 55.2965 33.2407 89.3825 53.1728 9.1818 3.6695 16.9905 10.7450 56.3941 16.3893 23.1634 3.3789 0.8930 25.8782 9.3562 3.4619 2.8196 0.2807 4.5641 96.0143 197.9734 17.5599 20.4437 2.0930 51.0543 70.9123 5.4144 71.6134 278.2675 2.2563 1.2560 0.6158 11.0649 28.6016 7.2015 91.0350 0.6276 44.3228 17.6297 37.8737 4.9815 2.5253 51.5805 385.0665 268.1301 8.2241 4.1187 4.8054 1.3926 0.5009 2.4616 2.4245 0.3163 3.7547 26.0083 25.8789
temp: 298.150 k
press: 1.00000 atm
elementType: 16 16 8 8 8 8 8 8 7 6 6 6 6 6 6 6 6 6 6 6 1 1 1 1 1 1 1 1 1 1 1
symmnumber: 1
zpe: 557179.5 jmol-1
zpe.correction: 0.212218 hartree
zpe.thermalcorrener: 0.232885 hartree
zpe.thermalcorrenthalpy: 0.233830 hartree
zpe.thermalcorrgfe: 0.158080 hartree
zpe.sumelectzpe: -1726.434378 hartree
zpe.sumelectthermal: -1726.413711 hartree
zpe.sumelectthermalent: -1726.412766 hartree
zpe.sumelectthermalfe: -1726.488516 hartree
dipole: 3.6255 1.3703 1.1590
dipole: 4.0454
quadrupole: -173.2780 -142.9120 -119.4025
quadrupole: -2.1155 8.8740 5.2670
quadrupole: -28.0805 2.2855 25.7950 -2.1155 8.8740 5.2670
hfenergy: -1726.646596 hartree
pointgroup: C01 [X(C11H11N1O6S2)]
dipole: 0.3367481 1.2731543 -0.8937342 debye
polarizability: 161.3781862|-13.3514335|258.2926557|-10.7487607|-22.8845603|170.2137889 unknown
InChI: InChI=1S/C11H11NO6S2/c13-9(14)5-19-11(20-6-10(15)16)7-1-3-8(4-2-7)12(17)18/h1-4,11,13,15H,5-6H2
charge 0 multiplicity 1
31 atoms
S  1.032866 1.86466 1.096348
S  -1.992682 1.539073 0.780522
O  1.731425 1.523881 -2.209694
O  -1.57674 2.582014 -2.351026
O  0.453925 -5.561402 -0.075091
O  -0.098237 -5.314664 2.124837
O  3.135625 3.250356 -1.523234
O  -3.646952 3.523134 -1.861264
N  0.128114 -4.84014 0.945525
C  -0.329988 0.887136 0.157049
C  -0.224915 -0.599545 0.383434
C  0.129595 -1.439358 -0.705448
C  -0.450753 -1.174317 1.664158
C  0.249867 -2.832377 -0.52896
C  -0.344295 -2.562728 1.854466
C  0.006675 -3.373271 0.75072
C  2.559565 1.422882 0.040195
C  -1.974596 3.242206 -0.067287
C  2.549045 2.180291 -1.265359
C  -2.518886 3.158964 -1.473509
H  -0.239187 1.149305 -0.9072
H  0.313592 -0.995454 -1.689477
H  -0.70215 -0.525224 2.509789
H  0.522391 -3.498065 -1.35197
H  -0.520169 -3.028544 2.827491
H  2.566502 0.333641 -0.116726
H  3.42213 1.732562 0.647443
H  -0.933198 3.603129 -0.046536
H  -2.619995 3.889597 0.54235
H  1.677458 2.075772 -3.036465
H  -1.99113 2.499486 -3.252977
