program: Gaussian 09
title: 000243991
version: EM64L-G09RevD.01
frameworkgroup: C1[X(C18H36N3PS)]
method: RPBEPBE
basis: SDD
operation: Freq
keyword: #p
keyword: freq=noraman
keyword: PBEPBE/SDD
title: #p freq=noraman PBEPBE/SDD
converged: YES YES NO NO
title: Mulliken charges:
elementType: S P N N N C C C C C C C C C C C C C C C C C C H H H H H H H H H H H H H H H H H H H H H H H H H H H H H H H H H H H H
charge: -0.274922 0.703185 -0.435835 -0.424480 -0.430439 -0.337152 -0.342123 -0.359702 -0.341732 -0.353860 -0.331145 -0.388458 -0.391908 -0.379893 -0.378228 -0.373073 -0.404712 -0.378678 -0.370319 -0.390723 -0.367669 -0.382984 -0.371782 0.212386 0.249996 0.242770 0.223735 0.261386 0.195771 0.201201 0.252862 0.204738 0.239856 0.243347 0.195477 0.197552 0.196030 0.199163 0.202622 0.211013 0.200114 0.197280 0.198106 0.191219 0.232850 0.204225 0.196302 0.198316 0.196468 0.199832 0.190418 0.198363 0.200793 0.188042 0.200581 0.197383 0.202196 0.199464 0.184775
chargesum: 0.00000
title: Mulliken charges with hydrogens summed into heavy atoms:
elementType: S P N N N C C C C C C C C C C C C C C C C C C
charge: -0.274922 0.703185 -0.435835 -0.424480 -0.430439 0.125229 0.124382 0.097455 0.112331 0.090734 0.107679 0.005124 0.009877 0.031234 0.017157 0.050996 -0.004185 0.016107 0.019931 0.008434 0.020953 0.016595 0.012458
polarizability: 2.74809667e+02 7.44208576e-01 2.49257210e+02 3.22731406e+00 -1.02438795e+01 2.30201482e+02
1716.lowfreq: -0.0002 0.0007 0.0018 6.4573 9.0994 15.1881 28.6776 33.2648 42.5591
frequency: 28.4261 32.6476 42.1295 48.8812 55.2226 67.6378 89.9206 101.0092 105.7316 115.1633 126.3907 141.2664 152.1580 174.9789 181.3271 216.6174 223.0241 237.0715 262.0865 287.8821 305.4356 315.0830 325.4591 329.0569 338.3059 353.5504 364.4450 368.8937 384.4526 394.7375 416.9535 426.2539 436.1024 491.6337 494.7174 505.4049 530.6565 536.7691 575.7446 634.2528 649.2532 655.0422 738.9770 741.0891 743.7433 762.9120 763.5905 768.9666 850.1911 850.7644 854.7031 858.5457 859.5381 864.3405 880.2823 889.8444 895.1761 911.0940 913.6483 917.8892 966.1781 968.6134 968.7131 1013.9447 1018.5676 1022.1287 1022.8555 1027.6388 1036.7796 1056.5395 1060.4014 1061.3061 1100.3259 1100.9493 1103.1249 1137.6476 1139.5254 1143.0080 1155.2044 1170.9327 1175.3863 1177.9705 1179.8626 1181.3662 1214.6233 1215.5462 1218.4471 1235.2603 1238.2616 1242.4720 1262.3541 1262.8774 1266.7574 1278.9120 1282.2555 1283.7033 1319.3625 1323.7180 1325.3785 1330.7268 1333.6939 1335.2819 1341.2340 1344.2757 1345.9142 1346.8373 1348.2280 1350.5612 1357.7098 1359.3122 1361.6867 1367.1565 1368.8467 1369.9093 1378.7059 1382.5038 1385.0534 1449.6651 1452.5712 1453.8460 1454.1421 1456.0269 1457.8366 1460.2369 1461.2102 1462.2843 1465.1787 1466.4515 1466.9516 1471.2696 1475.0325 1475.9884 1476.9087 1478.5160 1481.8025 2900.6174 2909.6169 2928.5443 2936.7501 2939.7095 2946.8756 2959.2536 2960.9461 2961.9685 2965.0689 2965.2656 2967.4576 2968.7771 2969.4922 2971.8021 2976.1769 2977.0839 2977.7295 3009.5815 3012.5514 3015.6223 3016.3278 3016.7629 3021.8647 3022.1747 3026.3893 3028.2864 3028.6086 3030.8125 3036.5007 3038.9466 3041.1479 3043.0745 3046.3851 3049.6667 3057.2901
redmass: 3.3031 3.4508 3.5306 3.8422 3.3745 3.4905 3.4072 3.7917 2.7350 2.5771 3.5209 2.4697 2.7945 2.7841 3.4935 2.9736 2.5660 3.6574 2.7978 2.4291 2.4294 2.3718 2.1230 3.0570 3.3888 2.8455 3.1545 3.4860 2.9883 2.5813 2.3321 2.5153 2.6854 1.8038 1.8091 1.7349 3.0950 3.2224 3.6964 3.0623 2.7681 3.1375 1.3028 1.3123 1.3060 2.6959 2.6236 2.7044 2.3356 2.1882 2.5916 1.8056 2.7940 1.8299 2.1886 2.2981 2.3487 1.7829 1.8386 1.8793 2.0383 2.0682 2.0770 2.2293 2.5152 1.6105 1.9875 1.6869 1.8675 2.1835 2.1183 2.1244 1.9866 1.9797 1.9918 2.2644 2.1513 2.1120 3.3136 3.0302 1.5726 1.4248 1.8994 2.4774 1.2984 1.2955 1.2940 1.2156 1.2180 1.2501 1.2872 1.2822 1.2873 1.1231 1.1356 1.1617 1.2689 1.3360 1.3721 1.3018 1.3224 1.2932 1.3883 1.3685 1.3619 1.4080 1.3839 1.3784 1.2752 1.3174 1.2725 1.2824 1.2733 1.2832 1.2862 1.2861 1.2610 1.0732 1.0821 1.0875 1.0841 1.0726 1.0865 1.0769 1.0781 1.0798 1.0844 1.0821 1.0858 1.0860 1.0861 1.0877 1.0841 1.0861 1.0851 1.0695 1.0705 1.0689 1.0642 1.0675 1.0633 1.0609 1.0601 1.0592 1.0597 1.0598 1.0618 1.0627 1.0623 1.0617 1.0657 1.0650 1.0653 1.0959 1.0990 1.1001 1.0969 1.0993 1.0970 1.0966 1.0977 1.1006 1.1000 1.0978 1.0987 1.1020 1.0930 1.0943 1.0967 1.1015 1.0901
irintensity: 0.4916 0.0244 0.1893 0.1955 0.4696 0.0993 0.5331 0.6709 0.3685 1.2198 2.0505 3.0300 0.5464 0.4481 3.9773 5.1367 0.8799 1.0667 1.1865 0.4920 2.0480 1.0026 0.8549 1.9876 0.4924 1.4645 2.7247 3.2881 7.8631 0.8065 10.4299 0.1544 3.6881 4.6357 2.6037 3.0670 7.4063 12.8243 21.9110 67.8805 63.1886 81.0102 2.0896 1.5612 3.4627 0.9054 1.7513 8.7475 35.8204 41.8708 2.5436 51.2887 5.0930 29.6927 53.2869 67.7032 33.3068 3.3573 6.0302 40.2468 12.9646 13.9219 3.9235 38.7584 41.7169 1.9608 23.4736 35.1852 34.1141 8.1073 12.1365 3.0879 2.7095 1.0620 2.3341 9.7669 14.5734 18.8126 33.0624 24.5270 23.7847 3.5830 9.9054 32.7033 6.3467 0.4855 5.4139 1.4471 1.3100 5.5819 4.3211 3.6675 11.1144 9.0003 9.4215 22.1443 3.3306 1.7923 6.6789 2.2637 1.0638 1.8339 1.3053 0.4125 1.4986 0.4078 2.2566 1.0588 1.7556 0.8733 0.5888 2.5055 2.9717 0.3427 7.5402 6.8082 2.1635 0.4525 10.7039 4.0332 2.7135 2.7731 9.2887 6.5626 1.8063 22.2255 14.9940 9.7108 10.6961 12.2359 5.9181 20.0144 8.4934 22.6126 20.9506 54.0106 60.0416 31.9173 50.2131 26.2164 28.8440 36.8087 37.3473 42.4773 21.6019 11.0161 44.4324 44.1988 69.1460 44.5394 41.0020 50.7435 30.5038 4.0158 33.9794 31.7622 58.2788 19.4688 75.6591 62.1457 65.7300 55.0972 28.3172 54.7283 94.9014 89.3745 18.3960 17.8266 53.7297 61.3106 25.2713
temp: 298.150 k
press: 1.00000 atm
elementType: 16 15 7 7 7 6 6 6 6 6 6 6 6 6 6 6 6 6 6 6 6 6 6 1 1 1 1 1 1 1 1 1 1 1 1 1 1 1 1 1 1 1 1 1 1 1 1 1 1 1 1 1 1 1 1 1 1 1 1
symmnumber: 1
zpe: 1381953.9 jmol-1
zpe.correction: 0.526358 hartree
zpe.thermalcorrener: 0.551367 hartree
zpe.thermalcorrenthalpy: 0.552311 hartree
zpe.thermalcorrgfe: 0.471553 hartree
zpe.sumelectzpe: -1609.156258 hartree
zpe.sumelectthermal: -1609.131250 hartree
zpe.sumelectthermalent: -1609.130305 hartree
zpe.sumelectthermalfe: -1609.211064 hartree
dipole: -0.7746 1.6191 -4.1393
dipole: 4.5117
quadrupole: -151.0760 -154.0166 -166.3280
quadrupole: 2.0450 -1.8521 8.4561
quadrupole: 6.0642 3.1236 -9.1878 2.0450 -1.8521 8.4561
hfenergy: -1609.6826165 hartree
pointgroup: C01 [X(C18H36N3P1S1)]
dipole: -0.346838 -0.5893262 1.6380197 debye
polarizability: 274.9304807|-0.7135052|248.6748571|-2.2109487|-10.7672468|230.6630216 unknown
InChI: InChI=1S/C18H36N3PS/c23-22(19-13-7-1-2-8-14-19,20-15-9-3-4-10-16-20)21-17-11-5-6-12-18-21/h1-18H2
charge 0 multiplicity 1
59 atoms
S  0.433944 1.484625 -2.625656
P  0.103806 0.69827 -0.69853
N  0.051617 -1.079648 -0.556153
N  -1.444081 1.24595 -0.036421
N  1.41658 1.077625 0.40016
C  -1.251645 -1.74887 -0.824945
C  1.201976 -1.740248 -1.250884
C  -2.301169 2.174016 -0.811517
C  -1.620553 1.317027 1.435462
C  1.965144 2.454544 0.349351
C  1.797557 0.267855 1.580012
C  -1.633339 -2.822464 0.223608
C  1.647341 -3.067105 -0.601751
C  -3.662704 1.58813 -1.253895
C  -2.951222 0.71855 1.948793
C  3.331531 2.594173 -0.366669
C  3.273917 -0.196863 1.598362
C  -0.482327 -3.751429 0.689767
C  0.545296 -4.137339 -0.404857
C  -4.442891 0.792221 -0.17076
C  -4.24425 1.267505 1.292051
C  4.350296 1.462969 -0.069349
C  4.338151 0.908115 1.38008
H  -1.209861 -2.208516 -1.8359
H  -2.045786 -0.98122 -0.848844
H  2.053831 -1.03582 -1.257436
H  0.92874 -1.914277 -2.315875
H  -1.740887 2.499893 -1.70921
H  -2.468768 3.074413 -0.182021
H  -1.562172 2.384387 1.751232
H  -0.782702 0.790633 1.925181
H  2.049029 2.807455 1.398869
H  1.23747 3.118543 -0.156381
H  1.142656 -0.621914 1.611448
H  1.605053 0.869738 2.498821
H  -2.445872 -3.431716 -0.224088
H  -2.066671 -2.326268 1.114576
H  2.102234 -2.854963 0.386459
H  2.453492 -3.481088 -1.242114
H  -3.506474 0.939455 -2.1380
H  -4.277393 2.444391 -1.600865
H  -2.987843 0.90394 3.042922
H  -2.930379 -0.380915 1.811356
H  3.758361 3.574099 -0.067263
H  3.152573 2.634027 -1.457272
H  3.421014 -0.974042 0.822419
H  3.445506 -0.688927 2.579269
H  -0.931715 -4.667747 1.121647
H  0.069536 -3.259773 1.515376
H  1.039728 -5.084953 -0.112593
H  0.029441 -4.341518 -1.365749
H  -4.154149 -0.276916 -0.217985
H  -5.520834 0.825003 -0.425556
H  -4.261261 2.375875 1.345689
H  -5.104497 0.917384 1.89671
H  5.363402 1.838094 -0.315683
H  4.159316 0.617437 -0.759385
H  5.331349 0.470503 1.604523
H  4.193358 1.732393 2.109365
