program: Gaussian 09
title: 000243902
version: EM64L-G09RevD.01
frameworkgroup: C1[X(C12H23N)]
method: RPBEPBE
basis: SDD
operation: Freq
keyword: #pfreq=noraman
keyword: PBEPBE/SDD
title: #p freq=noraman PBEPBE/SDD
converged: YES YES NO NO
title: Mulliken charges:
elementType: N C C C C C C C C C C C C H H H H H H H H H H H H H H H H H H H H H H H
charge: -0.563722 -0.011907 -0.007438 -0.474619 -0.473150 -0.467660 -0.467769 -0.441340 -0.433090 -0.079189 -0.407651 -0.408156 -0.380488 0.193142 0.192385 0.209276 0.194489 0.192602 0.208557 0.189644 0.209218 0.211058 0.189721 0.221958 0.175880 0.182302 0.186342 0.203866 0.193968 0.189674 0.189713 0.194230 0.197243 0.186767 0.255275 0.248868
chargesum: 0.00000
title: Mulliken charges with hydrogens summed into heavy atoms:
elementType: N C C C C C C C C C C C C
charge: -0.059578 0.181235 0.184947 -0.070854 -0.071991 -0.068798 -0.066990 -0.043502 -0.064447 0.124677 -0.024008 -0.024213 0.003523
polarizability: 1.62106539e+02 -9.13341128e-01 1.23496125e+02 -9.10704053e-01 -9.81169814e-01 1.07571256e+02
1716.lowfreq: -12.0857 -0.0003 -0.0003 0.0006 13.9073 19.0527 32.3187 59.2656 117.0528
frequency: 32.3027 59.2646 117.0160 133.7955 206.0404 217.5716 221.5156 241.1386 248.7105 307.1102 313.2281 366.3254 384.5125 420.7898 427.4357 456.1695 462.9312 465.9629 511.6723 605.4864 656.6413 773.4420 776.6599 781.9801 789.1180 838.9714 856.9375 884.8131 888.6724 893.3483 914.6782 941.7200 952.5542 973.0456 1020.3570 1040.8832 1049.7434 1052.5198 1060.8797 1072.0815 1076.6563 1094.5463 1104.0559 1116.2181 1122.1263 1145.9915 1172.3183 1193.9490 1209.5390 1220.9240 1245.9545 1255.2457 1255.6658 1263.3172 1279.1911 1292.7128 1300.2305 1309.1087 1313.2282 1324.3137 1326.6539 1331.9083 1335.8091 1337.9748 1340.5434 1344.2474 1348.2023 1366.6147 1383.4782 1454.3933 1456.8712 1461.0777 1461.5455 1464.0403 1466.1285 1468.7831 1472.8757 1478.2959 1635.8353 2912.2943 2925.6327 2944.1447 2948.4450 2948.7405 2951.0433 2955.1929 2960.0910 2961.7165 2962.0802 2964.2190 2969.6955 3013.7054 3021.0714 3022.8234 3027.5073 3030.3208 3038.0191 3038.8005 3043.3447 3043.6825 3412.6349 3537.6530
redmass: 2.6374 3.4678 2.7071 3.6464 1.5753 1.7691 2.1823 2.2210 1.7676 2.6198 1.8322 2.9869 1.7801 2.2932 3.0253 1.9138 2.8652 2.3041 2.0078 1.9781 1.5165 2.4860 1.4619 1.4978 2.3740 2.0377 2.3212 1.8055 1.3744 1.4076 2.1384 2.1375 2.0717 2.1467 1.9472 1.5988 1.1419 1.8307 1.3590 1.3284 1.7714 2.0869 2.4257 2.3516 2.8079 1.8850 1.9295 1.5252 1.4431 1.4279 1.2332 1.2721 1.2541 1.3240 1.2956 1.3099 1.3199 1.2744 1.1953 1.4284 1.4016 1.3868 1.5250 1.4044 1.5309 1.5001 1.5182 1.4640 1.5448 1.0885 1.0906 1.0881 1.0890 1.0890 1.0833 1.0827 1.0971 1.0947 1.0941 1.0789 1.0821 1.0681 1.0645 1.0652 1.0644 1.0667 1.0667 1.0610 1.0596 1.0657 1.0796 1.0992 1.0978 1.0955 1.0998 1.0982 1.0997 1.0945 1.0954 1.0967 1.0445 1.0960
irintensity: 0.2601 0.1065 0.1264 0.4131 11.1910 0.1232 3.2458 14.2926 24.5451 15.3902 1.3512 2.7972 0.1736 1.0949 0.4318 2.3652 6.8149 0.1153 0.4198 3.3083 248.0747 2.8485 0.5548 0.1041 1.0779 5.1202 4.1818 0.2551 3.9315 25.2341 0.0431 1.0318 4.1469 13.9043 0.3711 1.1108 0.1463 2.7544 1.8061 1.3341 15.3561 1.0635 1.3408 0.1100 7.9953 5.9553 1.1186 0.2475 0.6695 0.2077 0.4082 3.4325 3.5660 1.1941 4.5374 0.5628 0.1792 0.1838 1.4982 0.1125 0.8119 0.9896 1.9354 0.4043 1.0292 1.2470 6.2914 2.0488 5.7254 2.8237 6.0267 4.0035 8.3145 0.3444 9.6384 21.9833 6.4169 3.2786 37.9744 0.0414 12.9838 25.6859 43.1682 10.5650 5.9333 8.1381 81.9985 32.3206 57.9154 36.6998 69.3704 65.1358 69.1488 92.2628 4.1109 9.6494 159.5515 95.4392 77.7206 5.5540 3.4703 0.2584
temp: 298.150 k
press: 1.00000 atm
elementType: 7 6 6 6 6 6 6 6 6 6 6 6 6 1 1 1 1 1 1 1 1 1 1 1 1 1 1 1 1 1 1 1 1 1 1 1
symmnumber: 1
zpe: 868976.1 jmol-1
zpe.correction: 0.330976 hartree
zpe.thermalcorrener: 0.344266 hartree
zpe.thermalcorrenthalpy: 0.345210 hartree
zpe.thermalcorrgfe: 0.291544 hartree
zpe.sumelectzpe: -524.764584 hartree
zpe.sumelectthermal: -524.751293 hartree
zpe.sumelectthermalent: -524.750349 hartree
zpe.sumelectthermalfe: -524.804015 hartree
dipole: 0.5588 1.1229 0.5487
dipole: 1.3690
quadrupole: -87.7773 -83.8851 -80.6370
quadrupole: -6.8549 -3.1064 -0.8429
quadrupole: -3.6775 0.2147 3.4628 -6.8549 -3.1064 -0.8429
hfenergy: -525.0955593 hartree
pointgroup: C01 [X(C12H23N1)]
dipole: -0.223685 0.4414717 -0.2125346 debye
polarizability: 162.0833292|1.1711738|123.4989194|-1.1696064|1.0523282|107.5916711 unknown
InChI: InChI=1S/C12H23N/c13-12-8-6-11(7-9-12)10-4-2-1-3-5-10/h10-12H,1-9,13H2
charge 0 multiplicity 1
36 atoms
N  4.766817 -0.038379 -0.131164
C  0.340263 0.01918 -0.231914
C  -1.148418 0.007061 0.248403
C  1.117737 -1.244475 0.231443
C  1.100806 1.288137 0.242964
C  -1.926723 1.269006 -0.219727
C  -1.90518 -1.267924 -0.218952
C  2.60425 -1.235674 -0.196362
C  2.58534 1.289307 -0.195332
C  3.345971 0.025984 0.290469
C  -3.411999 1.256238 0.216084
C  -3.390458 -1.279486 0.216805
C  -4.137681 -0.017989 -0.270022
H  0.332941 0.024368 -1.346803
H  -1.140519 0.007216 1.363366
H  0.6404 -2.158295 -0.167831
H  1.056377 -1.31144 1.339204
H  1.044315 1.340794 1.352082
H  0.61136 2.201143 -0.143431
H  -1.872396 1.327519 -1.328587
H  -1.445943 2.184666 0.172039
H  -1.409085 -2.174846 0.173728
H  -1.849524 -1.326389 -1.32776
H  3.125652 -2.132069 0.187337
H  2.666134 -1.275264 -1.306511
H  2.64363 1.323932 -1.304903
H  3.093009 2.200529 0.181866
H  3.337699 0.0230 1.400818
H  -3.922704 2.162217 -0.16542
H  -3.465893 1.301464 1.324133
H  -3.443594 -1.324973 1.324867
H  -3.885917 -2.194107 -0.164104
H  -5.185929 -0.026825 0.087391
H  -4.174951 -0.01854 -1.379403
H  5.329827 0.746777 0.219351
H  4.868389 -0.129061 -1.150731
