program: Gaussian 09
title: 000243897
version: EM64L-G09RevD.01
frameworkgroup: C1[X(C12H21NO)]
method: RPBEPBE
basis: SDD
operation: Freq
keyword: #p
keyword: freq=noraman
keyword: PBEPBE/SDD
title: #p freq=noraman PBEPBE/SDD
converged: YES YES NO NO
title: Mulliken charges:
elementType: O N C C C C C C C C C C C C H H H H H H H H H H H H H H H H H H H H H
charge: -0.276410 -0.309782 -0.009918 -0.042790 -0.465367 -0.468570 -0.428554 -0.464214 -0.408130 -0.412537 -0.379512 -0.424028 -0.478782 0.135242 0.195565 0.206164 0.193741 0.199358 0.210581 0.195115 0.208298 0.211533 0.210070 0.226075 0.197846 0.189919 0.190884 0.198827 0.200806 0.187711 0.214306 0.224394 0.238253 0.216994 0.316911
chargesum: 0.00000
title: Mulliken charges with hydrogens summed into heavy atoms:
elementType: O N C C C C C C C C C C C C
charge: -0.276410 0.007129 0.185646 0.163375 -0.072268 -0.062874 -0.008722 -0.028069 -0.020365 -0.022826 0.009005 0.014672 -0.023536 0.135242
polarizability: 1.58293278e+02 4.42662514e+00 1.31255321e+02 1.86445667e-02 -7.77716456e-01 1.06271703e+02
1716.lowfreq: -29.3837 -12.4106 -0.0008 -0.0004 0.0001 2.6019 24.4297 49.6270 84.9050
frequency: 23.4544 49.5754 84.7789 115.3815 141.3759 214.5545 222.6306 256.3374 279.4445 321.1404 329.7664 392.6473 409.3847 422.8425 430.8495 444.5533 457.7779 510.7750 538.1767 594.3549 605.2710 691.1695 725.4370 782.7658 788.1661 802.6122 843.5154 864.5728 878.0059 883.8078 893.6469 918.0346 926.4388 952.2349 988.4144 1000.1189 1034.8056 1055.6432 1058.4533 1066.5286 1076.6590 1108.3947 1116.0574 1127.5300 1132.0765 1165.9870 1190.9914 1199.9115 1210.0021 1239.6667 1254.5425 1259.1073 1263.2236 1273.0817 1298.8967 1308.8733 1317.7581 1327.2649 1327.8474 1336.5229 1338.7829 1342.4585 1343.9551 1355.4403 1358.9875 1363.5344 1388.8031 1414.1739 1454.5725 1457.9082 1461.5519 1463.2958 1464.4540 1470.3446 1476.7181 1479.3292 1487.3914 1619.9486 2928.9314 2941.3093 2951.2048 2960.1126 2962.8060 2963.3931 2965.7438 2974.4767 2987.2449 2990.2944 2995.7687 3022.2885 3025.2143 3027.6424 3031.1551 3040.3421 3045.3724 3050.0709 3051.3449 3082.2154 3526.5081
redmass: 3.0300 4.8762 4.1920 2.7508 4.0713 1.8620 2.4405 2.9694 2.8317 2.0318 2.5436 3.2640 1.8785 2.6777 2.9646 2.2714 2.9702 1.6329 2.4511 1.5083 2.0254 3.2942 2.7856 1.5227 1.9737 3.0659 2.2631 2.2502 2.1379 1.8973 1.3981 2.2731 2.2874 2.1133 1.7964 2.0636 2.2808 1.3810 1.7677 2.0980 1.4387 2.0974 2.4656 1.7923 2.0975 1.4355 1.4869 1.1261 1.4419 1.3473 1.2989 1.2759 1.2701 1.2913 1.2699 1.3277 1.3848 1.4454 1.4035 1.5230 1.3944 1.4854 1.5130 1.3840 1.3733 1.4439 1.6632 1.8886 1.0900 1.0883 1.0846 1.0882 1.0892 1.0810 1.0947 1.1192 1.1028 5.1182 1.0791 1.0800 1.0646 1.0678 1.0616 1.0616 1.0641 1.0668 1.0661 1.0633 1.0633 1.0957 1.0962 1.0997 1.0979 1.1026 1.0995 1.0979 1.0950 1.0951 1.0763
irintensity: 0.5701 1.8488 1.3794 0.5997 0.5611 0.0225 0.1219 1.5599 1.9866 0.5924 1.3423 1.3826 0.4739 0.5281 0.0989 2.2366 6.8676 1.1415 17.4844 51.8481 14.3151 34.2056 5.8495 0.1703 0.7639 2.9533 6.5484 18.1861 0.6847 1.3693 9.2479 1.8221 0.6257 7.5980 5.2747 14.1067 2.5855 0.3597 1.1679 4.6843 0.8602 10.2568 1.8655 10.4426 3.9668 10.4069 8.3870 6.2430 4.3552 0.8577 15.7862 0.4795 5.3942 2.6413 5.1214 0.2255 2.9339 10.7535 9.9547 4.3427 0.0944 2.8317 13.5253 11.6406 4.6906 3.0811 31.6438 26.5174 31.1636 5.7298 2.8852 10.0513 6.1350 20.7936 0.5204 19.7315 20.0767 334.5843 0.9772 25.5179 19.9417 41.9725 33.0763 38.2914 33.4114 40.6849 15.0080 7.6335 87.0480 89.5017 99.3520 0.6213 10.6220 132.8783 44.1772 67.3817 21.4521 15.4646 16.2797
temp: 298.150 k
press: 1.00000 atm
elementType: 8 7 6 6 6 6 6 6 6 6 6 6 6 6 1 1 1 1 1 1 1 1 1 1 1 1 1 1 1 1 1 1 1 1 1
symmnumber: 1
zpe: 824220.6 jmol-1
zpe.correction: 0.313929 hartree
zpe.thermalcorrener: 0.327370 hartree
zpe.thermalcorrenthalpy: 0.328314 hartree
zpe.thermalcorrgfe: 0.273393 hartree
zpe.sumelectzpe: -598.747746 hartree
zpe.sumelectthermal: -598.734305 hartree
zpe.sumelectthermalent: -598.733361 hartree
zpe.sumelectthermalfe: -598.788281 hartree
dipole: 4.0136 2.7232 0.5294
dipole: 4.8791
quadrupole: -109.2074 -83.9412 -86.1579
quadrupole: -12.4023 -2.4920 -2.1995
quadrupole: -16.1052 9.1609 6.9443 -12.4023 -2.4920 -2.1995
hfenergy: -599.0616747 hartree
pointgroup: C01 [X(C12H21N1O1)]
dipole: 1.5754003 -1.0704602 -0.2386829 debye
polarizability: 158.2547365|-4.5412333|131.3182891|0.0405368|0.0673618|106.2472757 unknown
InChI: InChI=1S/C12H21NO/c14-12-7-6-11(8-9-13-12)10-4-2-1-3-5-10/h10-11,13H,1-9H2
charge 0 multiplicity 1
35 atoms
O  -4.209961 1.010831 0.591723
N  -2.908691 -0.896447 0.525388
C  1.110722 -0.053685 -0.111297
C  -0.104216 -0.197658 -1.0949
C  2.107293 -1.238246 -0.258376
C  1.864106 1.290541 -0.318091
C  -0.899621 -1.522168 -0.906886
C  -1.064173 1.026617 -1.093701
C  3.35002 -1.095485 0.653825
C  3.108248 1.428325 0.59239
C  4.081226 0.242849 0.41075
C  -1.650946 -1.66599 0.440351
C  -1.798004 1.31892 0.246808
C  -3.060249 0.481369 0.47221
H  0.739514 -0.063701 0.937838
H  0.337185 -0.242079 -2.116143
H  2.437307 -1.294886 -1.318183
H  1.60544 -2.197755 -0.0306
H  1.186888 2.144563 -0.129442
H  2.18001 1.36173 -1.381386
H  -0.212637 -2.382989 -1.009729
H  -1.642912 -1.616238 -1.723098
H  -1.823563 0.882779 -1.888074
H  -0.498215 1.931167 -1.380014
H  4.036828 -1.948321 0.487655
H  3.030701 -1.14489 1.716061
H  2.781951 1.469735 1.652841
H  3.621902 2.386473 0.380754
H  4.943375 0.342435 1.098471
H  4.489063 0.256681 -0.62142
H  -1.924447 -2.726798 0.584713
H  -0.979519 -1.398893 1.281147
H  -2.140502 2.366597 0.266491
H  -1.10089 1.187533 1.098067
H  -3.782331 -1.409716 0.66856
