program: Gaussian 09
title: 000243940
version: EM64L-G09RevD.01
frameworkgroup: C1[X(C27H28N2O3)]
method: RPBEPBE
basis: SDD
operation: Freq
keyword: #p
keyword: freq=noraman
keyword: PBEPBE/SDD
title: #p freq=noraman PBEPBE/SDD
converged: YES YES NO NO
title: Mulliken charges:
elementType: O O O N N C C C C C C C C C C C C C C C C C C C C C C C C C C C H H H H H H H H H H H H H H H H H H H H H H H H H H H H
charge: -0.268407 -0.269905 -0.452933 -0.022708 -0.012516 -0.133146 -0.075527 -0.543127 -0.119089 -0.482188 -0.547517 -0.467648 -0.288020 -0.062082 0.482902 -0.628570 0.205169 -0.330872 0.271654 -0.067334 -0.388843 -0.392978 -0.301200 -0.309905 -0.265590 -0.226489 0.372961 -0.355819 -0.388181 -0.222734 -0.217618 -0.242931 0.232341 0.257819 0.237264 0.226577 0.211035 0.222141 0.214893 0.260505 0.234486 0.240707 0.230601 0.261890 0.217240 0.218274 0.216175 0.244916 0.224889 0.240990 0.262331 0.264523 0.232882 0.235732 0.366844 0.245532 0.271179 0.225975 0.225852 0.227600
chargesum: 0.00000
title: Mulliken charges with hydrogens summed into heavy atoms:
elementType: O O O N N C C C C C C C C C C C C C C C C C C C C C C C C C C C
charge: -0.268407 -0.269905 -0.086089 -0.022708 -0.012516 0.099195 0.182292 -0.079287 0.091946 -0.045155 -0.052526 0.003661 -0.026130 0.155158 0.482902 -0.194121 0.205169 -0.085956 0.271654 -0.067334 -0.163954 -0.151988 -0.038869 -0.045383 -0.032708 0.009243 0.372961 -0.110287 -0.117002 0.003242 0.008234 -0.015331
polarizability: 3.12921491e+02 8.01587783e+00 3.24791985e+02 -3.46911300e+01 -7.36637158e+00 2.82947011e+02
1716.lowfreq: -8.9627 -1.8909 -0.0005 0.0002 0.0005 4.4489 6.8652 13.6167 20.2488
frequency: 4.6016 13.2060 19.8979 25.1119 31.3580 40.5591 48.3084 60.2022 67.8875 85.3889 99.9679 127.5713 161.1850 172.8185 176.1199 196.4806 205.4021 210.3389 236.0492 243.4744 251.3636 263.3292 304.8619 323.5734 335.0813 345.9492 368.7773 381.2147 407.2447 410.4982 412.5982 421.3069 430.7752 467.8845 472.4783 491.5057 497.3522 517.0697 523.8479 550.3517 570.7221 586.6974 602.2332 611.2036 615.6900 617.6272 650.5551 658.3209 661.0074 694.5398 708.9943 734.0498 756.5889 765.4038 772.4263 793.6465 804.9248 806.0460 809.0490 832.6809 841.9036 850.6189 857.4026 861.6710 867.9126 876.9796 886.9962 909.2613 920.4605 923.5384 936.0043 938.7169 948.6621 962.0858 969.0469 972.8336 982.0145 990.2523 995.7804 999.0893 1000.4880 1002.3080 1012.6974 1014.5373 1018.0869 1027.6776 1028.1265 1034.6781 1051.3487 1064.5954 1080.2739 1084.1276 1095.2328 1130.6159 1144.6508 1149.6612 1156.7597 1162.7869 1167.1662 1173.5881 1179.4580 1188.6779 1200.0948 1211.3606 1219.9290 1223.4083 1235.7692 1247.2696 1255.4787 1257.5479 1266.5963 1272.3377 1286.8170 1295.0135 1298.3791 1307.5388 1310.2101 1314.6189 1315.5329 1320.1041 1321.6517 1338.6414 1344.0954 1346.0643 1366.7142 1371.7923 1379.6404 1387.2763 1388.6085 1430.5389 1432.1690 1435.8833 1453.5287 1465.6664 1472.2597 1473.9698 1478.0640 1484.3086 1512.6785 1553.0513 1583.8347 1593.9653 1608.7288 1618.4276 1622.5848 1651.3614 2981.2666 2984.1056 2994.3854 2998.9683 3003.5020 3015.8120 3029.4579 3037.0899 3041.4434 3053.0660 3060.8917 3066.5403 3070.7308 3076.8299 3087.6343 3123.4682 3123.8863 3130.3524 3133.8675 3142.6716 3147.6835 3157.9642 3158.8631 3160.1910 3170.7480 3174.2709 3192.7123 3458.9659
redmass: 4.2881 5.8061 4.5028 5.3602 5.0808 4.7026 4.6280 5.0309 2.7874 5.0995 8.4494 4.1142 5.6028 3.2465 4.2657 4.7705 5.1546 3.6272 4.5916 2.5658 2.1670 4.7277 4.5498 4.3639 2.3381 3.6846 2.5524 1.7937 3.1907 2.3808 2.7801 3.5525 2.6362 3.1725 3.4996 3.9567 5.5325 6.1365 6.5447 4.4078 3.2326 4.9554 4.4519 5.7746 6.3803 6.2098 4.9115 1.9196 3.7431 4.6007 2.0028 2.4731 2.6044 1.7857 1.9347 2.8442 2.6834 2.2082 5.0800 3.6142 2.1397 2.1600 1.2880 1.6161 2.7271 2.6156 2.6243 3.9570 2.4265 3.1742 1.6017 1.3390 1.8066 1.4442 1.4425 2.0907 1.5076 4.1207 1.1649 1.3391 1.3386 1.9910 3.6897 3.6406 3.6805 2.1099 2.1441 2.4647 2.4556 3.3692 2.4763 1.5966 2.7567 1.9795 1.3266 1.7082 1.8722 1.8691 1.4481 1.3121 1.2278 1.3115 1.4344 1.2990 1.9077 1.6952 1.4886 1.3943 1.6127 2.0663 1.3428 1.3034 1.2841 1.3279 1.3071 1.3234 1.4363 1.3500 1.3299 1.6402 1.3223 1.4237 1.8048 1.5882 1.5905 1.3732 2.7897 2.9467 2.2875 1.2061 2.6760 2.1944 2.7509 1.0815 1.0826 1.0817 2.2326 1.0883 3.7683 6.8310 6.7192 6.3284 6.4678 8.0096 6.6746 4.6748 1.0842 1.0597 1.0617 1.0838 1.0610 1.0615 1.0842 1.0955 1.0962 1.0993 1.0841 1.0912 1.1014 1.1021 1.0693 1.0846 1.0893 1.0852 1.0886 1.0897 1.0933 1.0953 1.0953 1.0970 1.0977 1.0994 1.1142 1.0649
irintensity: 0.4198 0.2114 0.1483 0.1223 0.1825 0.3212 0.4585 0.5901 0.0526 0.1833 0.6105 0.5255 1.2410 0.6202 6.9759 2.5703 1.2356 2.7730 1.9728 0.3349 0.6513 1.3993 12.5467 12.4247 3.3349 14.2897 50.7196 42.7766 2.9661 1.9823 25.6199 15.6824 15.7337 3.9548 8.2365 33.1334 4.9539 5.7686 1.7470 3.4040 2.6021 10.4844 3.6384 15.3221 5.9465 19.2597 3.6396 14.4657 0.9156 7.6052 68.3637 25.4377 31.9097 15.9155 56.5885 0.9074 3.5570 37.5260 1.4073 4.1926 8.2813 29.1196 6.2187 44.9122 2.7643 20.6256 1.1104 5.0138 25.5700 22.0321 2.3010 70.0435 2.0549 1.4506 1.4783 16.7599 0.3687 0.4337 5.1983 0.4076 1.0684 0.3589 0.8883 88.6563 80.7777 24.7624 12.6454 11.7486 22.2976 6.1342 0.3704 9.3736 4.2721 4.4614 8.3278 159.2843 145.8152 13.0476 7.9721 3.6067 0.9293 4.8547 10.0130 5.4363 2.2378 187.7779 2.4758 9.9300 3.7045 2.7673 3.0110 4.0077 1.6985 1.3921 0.6971 8.3150 11.7128 2.7406 3.3603 4.4643 0.6731 0.5861 1.5520 0.9580 40.7062 5.3445 2.1047 16.9888 3.1762 5.4170 9.8144 12.7601 3.5297 1.5893 17.6201 19.8259 24.0910 0.3539 19.0169 13.8836 34.1798 1.0954 31.6989 74.5103 19.6644 29.1859 25.5614 29.2187 23.7131 12.5281 71.7864 26.1054 11.3542 12.7327 27.9765 24.6156 24.7006 2.0160 48.7830 53.1204 6.0994 0.3327 20.2162 1.4398 8.9793 16.6918 29.2517 18.2971 14.2788 19.3997 15.1034 17.6347 23.1427 39.7399
temp: 298.150 k
press: 1.00000 atm
elementType: 8 8 8 7 7 6 6 6 6 6 6 6 6 6 6 6 6 6 6 6 6 6 6 6 6 6 6 6 6 6 6 6 1 1 1 1 1 1 1 1 1 1 1 1 1 1 1 1 1 1 1 1 1 1 1 1 1 1 1 1
symmnumber: 1
zpe: 1283862.5 jmol-1
zpe.correction: 0.488997 hartree
zpe.thermalcorrener: 0.516824 hartree
zpe.thermalcorrenthalpy: 0.517768 hartree
zpe.thermalcorrgfe: 0.425760 hartree
zpe.sumelectzpe: -1378.504536 hartree
zpe.sumelectthermal: -1378.476709 hartree
zpe.sumelectthermalent: -1378.475765 hartree
zpe.sumelectthermalfe: -1378.567773 hartree
dipole: -3.4880 0.5112 -0.7189
dipole: 3.5978
quadrupole: -183.4425 -196.4310 -178.6829
quadrupole: 10.9447 -1.1299 9.1652
quadrupole: 2.7430 -10.2455 7.5025 10.9447 -1.1299 9.1652
hfenergy: -1378.993533 hartree
pointgroup: C01 [X(C27H28N2O3)]
dipole: 1.3617476 -0.0377249 -0.3845273 debye
polarizability: 315.0533772|-8.4089854|309.5171541|33.7941946|21.8907548|296.0899561 unknown
InChI: InChI=1S/C27H28N2O3/c1-2-18-17-29-15-13-20(18)16-24(29)26(22-12-14-28-23-11-7-6-10-21(22)23)32-27(31)25(30)19-8-4-3-5-9-19/h2-12,14,18,20,24-26,30H,1,13,15-17H2
charge 0 multiplicity 1
60 atoms
O  -0.912761 0.96887 -0.218936
O  -0.785856 0.998136 2.117428
O  -2.802207 2.813931 2.27765
N  1.476782 2.522422 0.250116
N  0.092588 -2.807568 -3.407322
C  3.90342 1.865594 -0.402122
C  1.445988 1.393431 -0.733249
C  2.892391 0.828346 -0.967526
C  3.786321 1.929678 1.158902
C  3.559276 3.273305 -0.967254
C  2.251169 2.156725 1.474675
C  2.144982 3.686309 -0.416025
C  0.430813 0.299826 -0.313365
C  4.335334 0.711854 1.863908
C  0.3089 -0.809367 -1.343028
C  5.327319 0.723655 2.789713
C  0.824048 -2.137339 -1.111088
C  -0.29851 -0.539158 -2.57547
C  -1.351567 1.313456 1.041537
C  0.69355 -3.105152 -2.189122
C  1.449911 -2.56426 0.108909
C  -0.387457 -1.559978 -3.569354
C  -2.662969 2.121092 1.005891
C  1.195579 -4.434529 -2.013765
C  1.924201 -3.869794 0.253517
C  1.802257 -4.812892 -0.815503
C  -3.869005 1.20819 0.70166
C  -3.978459 0.539501 -0.543761
C  -4.894133 1.058222 1.664112
C  -5.096852 -0.278542 -0.815944
C  -6.012061 0.237061 1.390253
C  -6.117379 -0.434736 0.151294
H  4.931584 1.57834 -0.685521
H  1.064557 1.825115 -1.679061
H  3.036354 -0.152551 -0.476652
H  3.069545 0.665854 -2.045967
H  4.364134 2.812452 1.499379
H  4.331612 4.004258 -0.663176
H  3.557919 3.238952 -2.073719
H  1.795988 1.259206 1.926963
H  2.127284 2.970204 2.210454
H  2.226567 4.493638 0.333545
H  1.488217 4.051553 -1.225987
H  0.669371 -0.086446 0.690807
H  3.868046 -0.253508 1.606946
H  5.823169 1.656391 3.087797
H  5.671953 -0.194565 3.278481
H  -0.72108 0.44977 -2.778014
H  1.546517 -1.870626 0.950826
H  -0.864694 -1.347252 -4.533312
H  -2.570843 2.890137 0.218098
H  1.077474 -5.128131 -2.851712
H  2.390007 -4.177903 1.195855
H  2.18115 -5.832322 -0.686051
H  -2.226376 2.337208 2.938101
H  -3.186504 0.647269 -1.292851
H  -4.811686 1.604336 2.608392
H  -5.170665 -0.794628 -1.779907
H  -6.801868 0.12807 2.142297
H  -6.984741 -1.07021 -0.060343
