program: Gaussian 09
title: 000243898
version: EM64L-G09RevD.01
frameworkgroup: C1[X(C10H18N2O2)]
method: RPBEPBE
basis: SDD
operation: Freq
keyword: #p
keyword: freq=noraman
keyword: PBEPBE/SDD
title: #p freq=noraman PBEPBE/SDD
converged: YES YES NO NO
title: Mulliken charges:
elementType: O O N N C C C C C C C C C C H H H H H H H H H H H H H H H H H H
charge: -0.277178 -0.277185 -0.400606 -0.400590 -0.099041 -0.099010 -0.438544 -0.438540 -0.394270 -0.394280 0.246349 0.246327 -0.779503 -0.779503 0.274261 0.274247 0.255845 0.181122 0.255832 0.181155 0.202365 0.209740 0.202369 0.209735 0.301936 0.301938 0.252104 0.255761 0.209647 0.252121 0.255753 0.209640
chargesum: 0.00000
title: Mulliken charges with hydrogens summed into heavy atoms:
elementType: O O N N C C C C C C C C C C
charge: -0.277178 -0.277185 -0.098670 -0.098652 0.175221 0.175237 -0.001577 -0.001552 0.017836 0.017824 0.246349 0.246327 -0.061991 -0.061989
polarizability: 1.50658241e+02 -3.24276886e-03 1.09809235e+02 -6.66781173e-01 1.09175921e-02 1.15933457e+02
1716.lowfreq: -17.3452 -9.0489 -3.9238 -0.0004 0.0003 0.0003 23.4681 25.2809 56.8303
frequency: 23.0585 25.2584 56.8269 61.7504 72.5997 85.8471 100.9614 127.7151 195.7844 199.7623 248.1815 256.7988 284.5910 364.5311 371.4971 452.0926 460.1386 462.7640 505.4280 509.9131 547.7793 592.3427 595.2324 625.5473 634.3616 664.7918 782.5647 803.5700 845.7625 861.5675 897.0362 920.3863 934.3152 968.3805 975.6339 1011.4444 1018.8969 1027.4841 1040.6119 1041.1746 1068.9742 1078.2626 1110.0285 1142.4200 1161.4383 1163.5858 1237.7701 1241.5675 1246.8187 1259.9498 1299.3065 1305.8332 1315.9606 1330.3305 1333.8791 1355.8050 1369.5670 1370.5894 1387.3491 1387.7428 1449.3482 1449.4464 1457.6661 1461.5973 1463.4087 1464.0703 1471.0398 1472.7483 1481.1359 1486.3996 1612.4010 1616.8950 2958.7842 2959.6490 2974.1814 2975.6060 2994.8609 2994.8921 3015.1712 3021.3704 3036.2582 3042.5676 3054.6447 3054.9774 3096.6140 3096.6447 3098.3606 3098.3870 3552.3966 3552.5498
redmass: 4.1691 4.8780 2.7960 1.4214 1.2363 2.2057 2.8140 2.6777 3.3546 6.4582 3.3544 3.1038 2.7251 1.9318 2.8556 1.9910 2.7290 2.5496 1.3705 1.4919 3.0104 3.3128 2.6250 3.4344 3.4182 2.2697 1.9204 2.4955 2.5254 2.6533 1.9693 2.5227 3.0710 1.8533 1.7608 2.7740 1.7462 1.6309 1.6492 1.6517 1.8026 1.9946 1.2647 2.2866 1.5836 2.6192 1.3542 1.5972 1.6526 1.2664 1.7609 1.4733 1.5831 1.4915 1.3518 1.5641 1.3660 1.3271 1.2320 1.2383 1.0514 1.0457 1.4497 1.2300 1.0885 1.1376 1.1694 1.2619 1.2529 1.3337 6.2249 6.5630 1.0691 1.0689 1.0656 1.0594 1.0362 1.0362 1.0843 1.0858 1.0966 1.0998 1.0934 1.0957 1.1005 1.1005 1.0979 1.0979 1.0779 1.0780
irintensity: 2.7694 8.9506 17.7996 2.7399 0.0030 6.2359 3.0838 0.3209 3.1307 4.1759 4.2363 0.0000 0.5200 1.0901 2.6757 2.6305 20.0845 5.8068 35.8538 127.5120 14.6189 2.0061 0.6438 1.0684 1.1844 5.1506 7.4871 0.0157 1.1402 3.9896 18.6983 15.8024 2.7069 9.0655 1.1342 1.4301 0.0655 2.1367 2.6964 22.6648 0.7153 0.8663 3.5760 1.8493 11.0963 8.3254 1.1477 36.8314 18.2313 10.0214 6.3841 102.2626 5.0730 0.3112 8.4913 0.0002 0.7530 0.0286 128.4077 9.0622 0.8521 25.1268 425.5028 28.0500 2.2467 46.1666 33.4957 23.0594 176.6450 14.3084 297.6987 51.4762 0.0722 70.3710 25.9795 50.0587 22.7576 0.2347 18.6458 25.5197 43.3364 57.1100 2.9123 63.3019 3.4692 39.6791 2.4936 14.0975 23.9228 9.1544
temp: 298.150 k
press: 1.00000 atm
elementType: 8 8 7 7 6 6 6 6 6 6 6 6 6 6 1 1 1 1 1 1 1 1 1 1 1 1 1 1 1 1 1 1
symmnumber: 1
zpe: 719467.9 jmol-1
zpe.correction: 0.274031 hartree
zpe.thermalcorrener: 0.289641 hartree
zpe.thermalcorrenthalpy: 0.290585 hartree
zpe.thermalcorrgfe: 0.228830 hartree
zpe.sumelectzpe: -650.742624 hartree
zpe.sumelectthermal: -650.727014 hartree
zpe.sumelectthermalent: -650.726069 hartree
zpe.sumelectthermalfe: -650.787825 hartree
dipole: -0.0024 3.1242 -0.0012
dipole: 3.1242
quadrupole: -89.4937 -88.3397 -87.6397
quadrupole: -0.0105 -22.8375 -0.0002
quadrupole: -1.0027 0.1513 0.8513 -0.0105 -22.8375 -0.0002
hfenergy: -651.0166548 hartree
pointgroup: C01 [X(C10H18N2O2)]
dipole: 0.0083622 1.2291452 0.0006177 debye
polarizability: 150.022093|-0.310858|109.8116214|4.6955994|-0.0316924|116.5672186 unknown
InChI: InChI=1S/C10H18N2O2/c1-7(13)11-9-5-3-4-6-10(9)12-8(2)14/h9-12H,3-6H2,1-2H3
charge 0 multiplicity 1
32 atoms
O  -2.872395 -1.06186 -1.744473
O  2.857221 -1.106767 1.742919
N  -1.867853 -0.136708 0.133054
N  1.865786 -0.164596 -0.133107
C  -0.562868 0.051649 -0.535229
C  0.563971 0.042574 0.535812
C  -0.544197 1.35367 -1.386309
C  0.56491 1.343745 1.388358
C  -0.560064 2.627849 -0.511549
C  0.599588 2.618583 0.515083
C  -2.947976 -0.698239 -0.530067
C  2.937633 -0.743083 0.528833
C  -4.223771 -0.854868 0.293431
C  4.210323 -0.918457 -0.295694
H  -0.436677 -0.814049 -1.213097
H  0.424818 -0.821937 1.212641
H  -1.406366 1.326769 -2.076125
H  0.36368 1.358062 -2.026965
H  1.426823 1.303234 2.077847
H  -0.34254 1.360819 2.029405
H  -1.528284 2.690118 0.026073
H  -0.4986 3.525943 -1.154875
H  1.56856 2.667044 -0.022598
H  0.551569 3.516661 1.159585
H  -1.971628 0.151779 1.106739
H  1.973601 0.123292 -1.106539
H  -5.042674 -0.302015 -0.198362
H  -4.512492 -1.919988 0.307128
H  -4.126771 -0.499286 1.334174
H  5.038302 -0.380035 0.196892
H  4.481804 -1.988072 -0.311984
H  4.118567 -0.559035 -1.335597
