program: Gaussian 09
title: 000020868
version: EM64L-G09RevD.01
frameworkgroup: C1[X(C9H12ClN5)]
method: RPBEPBE
basis: SDD
operation: Freq
keyword: #p
keyword: freq=noraman
keyword: PBEPBE/SDD
title: #p freq=noraman PBEPBE/SDD
converged: YES YES NO NO
title: Mulliken charges:
elementType: Cl N N N N N C C C C C C C C C H H H H H H H H H H H H
charge: -0.074197 -0.293021 -0.214961 -0.653964 -0.629639 -0.651675 0.475395 -0.539832 -0.390148 -0.416452 -0.218770 -0.216472 -0.100491 0.240306 0.240884 0.199084 0.223634 0.265674 0.232114 0.250987 0.252004 0.325772 0.328699 0.305497 0.335364 0.438973 0.285236
chargesum: 0.00000
title: Mulliken charges with hydrogens summed into heavy atoms:
elementType: Cl N N N N N C C C C C C C C C
charge: -0.074197 -0.293021 -0.214961 0.000507 0.011222 0.072534 0.475395 -0.117115 -0.124474 -0.184338 0.032217 0.035532 -0.100491 0.240306 0.240884
polarizability: 2.15541786e+02 1.68571340e+00 1.55547010e+02 -9.74564642e+00 6.49429862e+00 7.39421397e+01
1716.lowfreq: -10.1113 -4.0589 -0.0015 0.0007 0.0018 3.5973 28.3461 31.3530 46.5768
frequency: 28.3248 31.2545 46.5749 94.5304 119.9544 127.4653 175.4663 210.8920 219.3210 257.9893 267.4333 304.7252 327.9067 343.1704 393.5604 404.3138 410.7858 453.6142 467.3723 502.8384 516.5647 519.1978 527.2091 624.1370 636.8480 683.0702 690.9416 702.6500 714.2009 805.1622 817.0175 834.0171 857.0764 939.5571 957.5468 970.6814 990.8003 996.5070 1005.6297 1011.8587 1069.7491 1082.1319 1102.5736 1127.0563 1171.5181 1175.2696 1206.1921 1216.6447 1285.4501 1322.9058 1380.9402 1393.0596 1397.9284 1432.9548 1452.2487 1476.2388 1511.1099 1557.6156 1590.1897 1600.4407 1601.8127 1603.8165 1654.3194 2778.1889 2850.2910 2917.1508 3121.7979 3148.2294 3166.8170 3170.2211 3562.4783 3563.6426 3595.9160 3718.4404 3718.8735
redmass: 4.7495 4.3977 6.2045 5.1561 4.9918 4.2140 4.7993 3.0998 2.1084 2.4250 2.3417 3.9650 3.7168 1.3400 6.7270 3.0379 2.9196 1.2078 3.4775 3.0016 2.6888 1.1716 1.1928 6.8208 5.5348 8.0445 4.6823 3.6714 8.5262 2.1255 2.1606 1.2629 3.8245 1.3704 2.7788 1.3539 1.5146 2.7666 1.7281 1.8018 2.6669 1.6902 1.3841 3.1454 1.9043 1.1134 1.7552 1.3769 1.2660 1.6951 5.6169 2.6694 3.5810 1.8295 1.1379 2.3879 3.2432 3.3992 6.7868 1.5719 2.9957 1.7328 2.1955 1.0801 1.0649 1.0903 1.0897 1.0882 1.0954 1.0966 1.0444 1.0449 1.0823 1.1045 1.1052
irintensity: 0.1291 0.3248 0.4538 0.6520 1.4699 11.7970 5.6303 4.2562 16.6870 62.4623 47.9773 2.6122 0.2479 124.4159 13.0482 19.6655 0.6751 396.7224 20.9109 12.0723 12.2721 86.6066 44.6001 0.4003 11.7815 0.4835 5.3184 1.0785 11.2108 39.9877 51.3021 10.2790 4.3677 2.8995 2.5659 20.6028 56.5304 22.4600 61.7694 8.1524 31.1655 3.0252 15.7500 44.8785 0.8946 4.8535 1.7711 4.7653 19.8548 93.7381 22.2437 11.4229 200.0867 160.0847 32.7375 82.7505 104.8257 334.5832 1.2475 118.8023 251.0083 273.9052 851.5077 665.1519 38.2210 46.8911 13.5037 1.5810 9.7658 1.0079 44.7630 78.6988 19.5999 27.1435 34.0439
temp: 298.150 k
press: 1.00000 atm
elementType: 17 7 7 7 7 7 6 6 6 6 6 6 6 6 6 1 1 1 1 1 1 1 1 1 1 1 1
symmnumber: 1
zpe: 548561.8 jmol-1
zpe.correction: 0.208936 hartree
zpe.thermalcorrener: 0.224116 hartree
zpe.thermalcorrenthalpy: 0.225060 hartree
zpe.thermalcorrgfe: 0.165056 hartree
zpe.sumelectzpe: -1082.890049 hartree
zpe.sumelectthermal: -1082.874869 hartree
zpe.sumelectthermalent: -1082.873925 hartree
zpe.sumelectthermalfe: -1082.933929 hartree
dipole: 3.9854 -0.1256 0.3319
dipole: 4.0012
quadrupole: -94.6538 -71.0030 -99.2797
quadrupole: -12.4362 -1.6985 -0.8267
quadrupole: -6.3417 17.3092 -10.9675 -12.4362 -1.6985 -0.8267
hfenergy: -1083.0989851 hartree
pointgroup: C01 [X(C9H12Cl1N5)]
dipole: -1.5725442 0.0575516 -0.0432762 debye
polarizability: 212.3475378|-17.6909912|125.8624773|-13.9032733|-39.0158357|106.8209212 unknown
InChI: InChI=1S/C9H12ClN5/c10-7-3-1-6(2-4-7)5-14-9(13)15-8(11)12/h1-4H,5,11-13H2
charge 0 multiplicity 1
27 atoms
Cl 5.252057 -1.469821 0.455172
N  -1.292043 0.448671 -0.44302
N  -3.644864 0.455573 0.095139
N  -2.740233 2.323636 -0.914914
N  -4.809292 -1.317442 1.040388
N  -2.489547 -1.589174 0.577462
C  1.178786 0.472705 -0.667828
C  -0.140132 1.156365 -1.017851
C  1.324929 -0.249641 0.541865
C  2.297769 0.588975 -1.528816
C  2.559037 -0.841976 0.892861
C  3.541562 0.004523 -1.197618
C  3.649933 -0.703125 0.0141
C  -2.491096 1.04414 -0.423007
C  -3.614141 -0.806121 0.560646
H  -0.078438 2.209929 -0.643752
H  -0.2190 1.227275 -2.127279
H  0.459688 -0.344542 1.205608
H  2.203902 1.135648 -2.475486
H  2.669685 -1.397305 1.829046
H  4.401374 0.092946 -1.867989
H  -2.017854 2.893081 -1.3430
H  -3.689436 2.677351 -0.828306
H  -4.881635 -2.238721 1.46073
H  -5.619131 -0.70431 1.005283
H  -1.649888 -1.065327 0.17185
H  -2.498891 -2.563815 0.871615
