program: Gaussian 09
title: 000243856
version: EM64L-G09RevD.01
frameworkgroup: C1[X(C8H15NO)]
method: RPBEPBE
basis: SDD
operation: Freq
keyword: #p
keyword: freq=noraman
keyword: PBEPBE/SDD
title: #p freq=noraman PBEPBE/SDD
converged: YES YES NO NO
title: Mulliken charges:
elementType: O N C C C C C C C C H H H H H H H H H H H H H H H
charge: -0.459898 -0.177766 0.400066 -0.524409 -0.123946 -0.745375 -0.747483 -0.356639 -0.061581 -0.597313 0.221833 0.219078 0.196949 0.219583 0.199526 0.229863 0.199524 0.209766 0.263597 0.204391 0.201232 0.246215 0.345658 0.216802 0.220326
chargesum: 0.00000
title: Mulliken charges with hydrogens summed into heavy atoms:
elementType: O N C C C C C C C C
charge: -0.114240 -0.177766 0.400066 -0.083498 0.073003 -0.096403 -0.074596 0.048985 0.184634 -0.160184
polarizability: 1.15338483e+02 8.63553629e+00 9.19918673e+01 -4.08148589e+00 -2.34022155e+00 8.25264953e+01
1716.lowfreq: -17.3544 -7.2265 -0.0009 -0.0007 -0.0006 8.3426 57.9820 61.5546 90.6896
frequency: 57.9223 61.4945 90.6721 136.3159 156.5517 179.5056 200.4284 214.0528 233.4401 277.7974 306.9961 351.0372 381.2815 411.8149 427.0505 480.3770 501.9450 640.1228 681.1628 730.5510 828.4499 896.5586 925.8341 943.9920 946.4760 952.5877 969.2655 997.2787 1006.3351 1011.8742 1037.3496 1062.5276 1098.3416 1115.5714 1138.0257 1149.3559 1219.0040 1223.1963 1262.7992 1274.4409 1281.2203 1321.6714 1344.7358 1382.9960 1390.6259 1404.0101 1426.4077 1454.4312 1459.6717 1467.1608 1469.2066 1478.5534 1486.5280 1656.9074 2930.7663 2955.6752 2974.6058 2982.6154 3019.3322 3044.2059 3065.0446 3072.4079 3083.8616 3089.6797 3092.7893 3099.9711 3147.2238 3194.1200 3574.7856
redmass: 3.0186 2.8172 3.7722 2.6743 1.4985 1.7037 1.1831 1.1092 2.0063 2.5796 2.4388 2.2324 2.3776 3.2227 2.7122 2.7265 2.8453 1.9932 3.7009 3.0570 3.3006 1.2733 1.8298 1.4505 1.5749 1.4036 5.1912 1.3113 1.3852 1.4204 1.5164 1.7781 1.4127 1.7966 2.2155 2.4821 1.4011 1.1484 1.3790 1.2899 2.4617 1.2472 3.2461 1.3306 1.2141 1.3839 1.1984 1.0562 1.0742 1.0801 1.1334 1.1027 1.0481 4.7687 1.0814 1.0547 1.0359 1.0363 1.1082 1.0547 1.0988 1.0982 1.0607 1.0995 1.0990 1.0926 1.1155 1.1141 1.0665
irintensity: 0.2237 0.5556 1.5082 2.3351 0.9386 6.9680 33.7681 112.1723 7.0801 1.1994 0.3609 0.2725 1.2653 6.1761 2.7019 3.9640 15.2382 21.0128 1.8262 9.6897 5.0835 1.2073 19.4022 7.7501 28.0591 60.7433 52.9912 0.8600 12.0440 21.1479 2.2447 11.6833 7.3285 12.4685 1.6766 47.3305 16.0205 4.6383 12.4839 0.0279 4.3017 12.6928 45.2551 33.6110 14.6087 0.3047 10.0897 3.3190 10.0423 9.2719 2.3970 2.6013 18.4542 8.8829 29.5973 68.7684 35.2415 33.0448 53.4680 34.2805 23.6351 42.1369 12.4405 16.5983 29.9016 8.7664 29.1645 28.4601 3.5695
temp: 298.150 k
press: 1.00000 atm
elementType: 8 7 6 6 6 6 6 6 6 6 1 1 1 1 1 1 1 1 1 1 1 1 1 1 1
symmnumber: 1
zpe: 561832.1 jmol-1
zpe.correction: 0.213991 hartree
zpe.thermalcorrener: 0.226424 hartree
zpe.thermalcorrenthalpy: 0.227368 hartree
zpe.thermalcorrgfe: 0.175953 hartree
zpe.sumelectzpe: -442.925458 hartree
zpe.sumelectthermal: -442.913025 hartree
zpe.sumelectthermalent: -442.912081 hartree
zpe.sumelectthermalfe: -442.963496 hartree
dipole: -0.7245 0.8648 0.1051
dipole: 1.1331
quadrupole: -59.8601 -56.1211 -62.3402
quadrupole: -0.7302 0.3732 -3.4282
quadrupole: -0.4196 3.3194 -2.8997 -0.7302 0.3732 -3.4282
hfenergy: -443.139449 hartree
pointgroup: C01 [X(C8H15N1O1)]
dipole: -0.389641 -0.212898 -0.0398082 debye
dipolederiv: -0.4974877 0.1854712 -0.0870139 0.2159146 -0.6112018 -0.2082269 -0.0826643 -0.2794165 -0.4582658 -0.9162647 -0.0271202 0.0903005 -0.1282949 -0.2135448 0.0748885 0.2145409 -0.0173429 -0.3708855 0.4771566 -0.0485811 -0.0126991 -0.0002993 0.1963696 -0.0682342 -0.0802098 -0.0362306 0.2726885 0.1140652 0.0590035 0.0757904 0.1078334 -0.0611677 -0.0078463 0.0158058 0.0157734 0.1479965 0.6009758 0.0573617 0.0260275 0.1170635 0.0520186 -0.0489667 0.0733415 0.0348645 0.1815954 -0.0223629 0.0529891 -0.0716486 0.0637222 0.0360799 0.0157691 -0.0310231 0.0008961 -0.0500977 -0.0460933 0.0323362 -0.0106582 0.0046913 0.0123273 -0.0111302 -0.0111383 -0.0065185 -0.1377092 0.2944198 -0.1111689 0.0162512 -0.1935175 0.5511941 0.1434185 0.00342 0.1319955 0.3759274 -0.0912975 -0.2296931 0.0272006 -0.2394186 0.0123649 0.0422722 -0.077151 0.1043019 0.1513147 -0.3152409 -0.1242893 -0.0120469 -0.1070012 -0.2331774 0.0627924 -0.0163045 0.0720573 0.0742901 0.0076107 -0.0758665 -0.0651732 -0.0914225 -0.0232097 -0.0483928 -0.099463 -0.1003704 -0.029891 0.0423864 0.0328251 -0.0976567 -0.0120159 -0.038999 0.0714305 -0.0382977 0.1400779 -0.040425 -0.0574206 -0.0268272 -0.0210163 0.0083595 0.0259486 0.0616678 -0.0946276 0.0132072 -0.1818646 0.0718298 -0.0481292 -0.0037732 0.0231831 -0.1697572 -0.0033057 -0.0169023 -0.02378 0.0946519 -0.1826106 0.0052912 0.0725983 -0.0342794 0.0634276 0.0318045 0.1076051 0.0323328 0.0450821 0.1032546 0.0086587 0.0061956 -0.0099452 0.0730834 -0.0760591 -0.0409265 -0.0353019 -0.1276361 0.0007076 0.0929133 -0.1164838 0.1043276 -0.0115484 0.0801458 -0.0824358 0.0434369 0.0120324 -0.1439906 0.0003083 0.1415684 -0.0081619 0.0912303 -0.0042676 0.1115197 -0.0294996 0.0225439 0.1241456 -0.0494427 -0.0403741 -0.0333654 -0.0770996 -0.0527958 -0.0151172 -0.0205038 0.0843194 0.0724171 0.0565689 -0.0309749 0.0312991 0.0153634 -0.0060826 0.0409835 0.0150831 -0.1892148 -0.2431426 0.0177171 -0.0024757 -0.0107102 0.01065 -0.0244619 -0.0633377 -0.0402645 0.0340774 0.1266515 0.0394592 -0.0384429 0.0564503 0.0865814 0.0096353 0.0229796 -0.047279 -0.1045669 0.2639742 -0.0869967 0.1005788 -0.0685868 0.0706156 0.0732209 0.12708 0.1157469 0.2695023 0.0772596 0.1446828 0.0429943 0.1654375 0.0219986 -0.0685297 0.0512324 -0.0766166 0.0390251 0.1390571 0.0425284 0.0109317 0.0387368 0.1204524 -0.0387461 -0.0189095 -0.0066493 -0.1144903 unknown
polarizability: 106.944271|-14.4645614|101.0360281|-0.976471|0.1184533|81.876547 unknown
InChI: InChI=1S/C8H15NO/c1-4-7(5-10)9-6-8(9,2)3/h4,7,10H,1,5-6H2,2-3H3
charge 0 multiplicity 1
25 atoms
O  -0.708357 -2.2694 -0.464944
N  0.53285 0.200883 0.579871
C  1.75818 -0.081585 -0.282191
C  1.417525 1.344651 0.137374
C  -0.846629 0.120578 0.012148
C  2.843252 -0.847532 0.46513
C  1.616697 -0.464554 -1.754404
C  -1.429428 -1.26771 0.341009
C  -1.693168 1.197256 0.669224
C  -2.494355 2.063112 0.001629
H  1.97192 1.845054 0.94023
H  1.037484 2.018175 -0.644806
H  -0.889956 0.25381 -1.092778
H  2.655559 -1.935258 0.396313
H  3.84209 -0.638688 0.036933
H  2.848552 -0.568294 1.532362
H  0.950041 0.217781 -2.31088
H  2.609172 -0.427426 -2.241519
H  1.21028 -1.487136 -1.843341
H  -1.295075 -1.457002 1.426077
H  -2.510747 -1.277334 0.091387
H  -1.614461 1.246187 1.765591
H  -0.970932 -3.174885 -0.164873
H  -3.090771 2.816155 0.529021
H  -2.578324 2.044363 -1.092564
