program: Gaussian 09
title: 000243872
version: EM64L-G09RevD.01
frameworkgroup: C1[X(C16H14O2S2)]
method: RPBEPBE
basis: SDD
operation: Freq
keyword: #p
keyword: freq=noraman
keyword: PBEPBE/SDD
title: #p freq=noraman PBEPBE/SDD
converged: NO YES NO NO
title: Mulliken charges:
elementType: S S O O C C C C C C C C C C C C C C C C H H H H H H H H H H H H H H
charge: 0.065023 -0.019602 -0.139180 -0.158687 0.332748 0.328553 0.306734 0.296200 -0.403963 -0.394148 -0.319920 -0.312423 -0.791724 -0.786112 -0.216136 -0.213008 -0.256602 -0.247649 -0.259593 -0.235728 0.238439 0.239621 0.302525 0.253766 0.261119 0.220554 0.238925 0.244053 0.219214 0.257701 0.233360 0.235611 0.241817 0.238511
chargesum: 0.00000
title: Mulliken charges with hydrogens summed into heavy atoms:
elementType: S S O O C C C C C C C C C C C C C C C C
charge: 0.065023 -0.019602 -0.139180 -0.158687 0.332748 0.328553 0.306734 0.296200 -0.165523 -0.154526 -0.017396 -0.058658 -0.071125 -0.065143 0.017223 0.022603 -0.014785 -0.009138 -0.259593 -0.235728
polarizability: 3.17291630e+02 2.43155300e+01 2.10385397e+02 1.86652356e+01 -1.28932449e+01 1.53879829e+02
1716.lowfreq: -6.6736 -6.4881 0.0013 0.0014 0.0015 5.6373 16.1093 23.2522 32.0553
frequency: 15.9697 23.1799 32.0147 47.7581 69.4361 80.9450 96.3561 117.0148 119.5494 143.2438 158.9756 163.2573 193.8843 215.8188 218.2096 253.8875 275.0166 337.8689 364.2688 386.9563 396.5655 402.0208 423.2712 428.3140 463.5248 473.4642 495.8034 501.2247 561.9992 564.7513 625.2771 636.1881 653.7738 660.3966 729.5793 737.1813 759.5945 766.0700 777.6700 779.9765 853.4211 863.1694 880.1572 891.5068 959.9538 978.3988 993.2284 994.5428 998.3388 1010.0595 1045.3331 1046.2989 1049.2978 1051.1744 1118.5070 1121.1029 1179.8814 1180.3486 1188.0076 1192.1235 1219.8976 1226.3040 1287.4139 1291.1568 1369.1792 1369.9686 1404.0717 1405.4784 1426.3767 1427.6155 1458.9174 1460.7271 1471.2845 1472.2298 1474.1657 1477.1101 1571.1550 1572.0506 1607.6798 1608.3011 1619.8707 1627.0061 2991.2303 2993.0535 3074.4898 3076.3325 3094.7903 3095.1803 3127.4763 3128.9646 3136.7437 3140.6112 3149.4773 3150.1002 3167.5154 3169.2576
redmass: 5.5013 4.1659 5.6282 6.3918 6.5045 8.8071 6.7140 3.7934 1.2593 1.1324 4.2967 3.6203 6.3004 4.3391 4.0059 5.1697 6.4009 11.7869 9.2259 3.9771 3.1915 4.4581 5.0425 6.1572 4.0367 3.8535 4.2285 5.6034 6.0295 6.3710 5.3801 5.3965 7.4209 7.2683 2.2418 2.7769 4.1879 4.1946 1.7112 1.5243 5.3898 5.7100 1.3179 1.2789 1.3834 1.3550 1.6078 1.6134 1.3474 1.3123 1.5832 1.5935 2.1846 2.2028 1.9594 1.9586 1.1049 1.0856 2.7428 2.9395 2.5165 2.6010 1.4452 1.4284 7.1691 7.4342 1.2357 1.2419 1.9062 1.9563 1.0864 1.0873 1.7842 1.7512 1.3839 1.3781 6.2279 6.2319 6.0114 6.0566 11.6012 11.5076 1.0368 1.0367 1.0968 1.0964 1.1005 1.1009 1.0863 1.0864 1.0892 1.0895 1.0943 1.0949 1.1009 1.1007
irintensity: 0.1618 0.4520 0.3457 1.6999 0.8712 0.6879 0.6012 0.3052 0.8795 1.2631 1.8275 1.7127 1.0223 2.5737 3.2416 11.1139 0.7353 0.3200 0.6617 1.4503 1.6545 5.6713 7.6210 13.5050 5.5688 7.5513 10.8215 1.7475 0.4895 1.5814 27.9154 27.5791 115.3724 17.0845 20.5767 11.6655 77.5383 88.2060 34.6412 49.0781 219.6626 53.1980 0.9160 0.9108 0.3180 1.8998 0.5654 0.8920 0.3095 1.0678 10.0785 14.5059 4.7830 4.8489 26.8227 10.2766 15.0608 5.4189 91.8659 71.9434 61.8529 42.2074 3.6186 1.4503 6.4425 6.2876 25.9766 22.4452 0.7731 0.9735 21.0544 29.4102 76.5035 33.9941 3.7701 3.0297 17.5836 23.0160 10.1477 11.9796 248.9398 152.2053 15.9352 14.8706 9.5143 8.6091 29.9113 24.3298 4.2960 6.3684 4.4351 15.5135 27.5644 8.1016 18.7367 22.6931
temp: 298.150 k
press: 1.00000 atm
elementType: 16 16 8 8 6 6 6 6 6 6 6 6 6 6 6 6 6 6 6 6 1 1 1 1 1 1 1 1 1 1 1 1 1 1
symmnumber: 1
zpe: 664455.5 jmol-1
zpe.correction: 0.253078 hartree
zpe.thermalcorrener: 0.273114 hartree
zpe.thermalcorrenthalpy: 0.274058 hartree
zpe.thermalcorrgfe: 0.201496 hartree
zpe.sumelectzpe: -1563.266331 hartree
zpe.sumelectthermal: -1563.246295 hartree
zpe.sumelectthermalent: -1563.245351 hartree
zpe.sumelectthermalfe: -1563.317912 hartree
dipole: 3.3032 5.3234 -0.5539
dipole: 6.2894
quadrupole: -113.1543 -130.4997 -132.0608
quadrupole: -8.6137 3.7506 -2.5329
quadrupole: 12.0839 -5.2614 -6.8225 -8.6137 3.7506 -2.5329
hfenergy: -1563.5194083 hartree
pointgroup: C01 [X(C16H14O2S2)]
dipole: 1.1450653 2.1147574 0.5826991 debye
polarizability: 306.4812744|20.7824674|214.3016851|45.1126423|9.7053212|160.7738963 unknown
InChI: InChI=1S/C16H14O2S2/c1-11-7-3-5-9-13(11)15(17)19-20-16(18)14-10-6-4-8-12(14)2/h3-10H,1-2H3
charge 0 multiplicity 1
34 atoms
S  -1.071656 -2.337854 -1.550121
S  0.57263 -0.794189 -1.804097
O  -3.72337 -2.143394 -1.390437
O  1.182667 -1.697165 0.74893
C  -3.691336 0.80695 -0.625104
C  3.872817 -0.334963 0.607548
C  -2.696411 -0.186202 -0.340471
C  2.690467 0.021636 -0.124355
C  -3.642748 2.012734 0.11677
C  4.951703 0.584316 0.596877
C  -1.725181 0.029061 0.672925
C  2.618549 1.265695 -0.812182
C  -4.762721 0.612668 -1.681998
C  4.013442 -1.64225 1.363567
C  -2.676192 2.226492 1.12565
C  4.876989 1.816946 -0.089161
C  -1.719134 1.227039 1.413435
C  3.702994 2.163114 -0.795798
C  -2.716547 -1.48221 -1.059694
C  1.521213 -0.902881 -0.151582
H  -4.382345 2.792748 -0.098057
H  5.867368 0.323722 1.139999
H  -1.006892 -0.764076 0.90598
H  1.694842 1.539141 -1.33433
H  -5.482498 -0.16742 -1.377284
H  -5.315138 1.552132 -1.850864
H  -4.338141 0.281531 -2.646876
H  3.729765 -2.51155 0.744118
H  5.053171 -1.780085 1.704868
H  3.346768 -1.667965 2.243413
H  -2.67528 3.167331 1.68741
H  5.73051 2.503589 -0.069934
H  -0.978639 1.376576 2.20584
H  3.631731 3.120982 -1.320886
