program: Gaussian 09
title: 000243828
version: EM64L-G09RevD.01
frameworkgroup: C1[X(C9H13N)]
method: RPBEPBE
basis: SDD
operation: Freq
keyword: #pfreq=noraman
keyword: PBEPBE/SDD
title: #p freq=noraman PBEPBE/SDD
converged: YES YES NO NO
title: Mulliken charges:
elementType: N C C C C C C C C C H H H H H H H H H H H H H
charge: -0.022567 -0.138748 -0.075914 -0.064120 -0.510327 -0.476718 -0.477792 -0.445933 -0.449213 -0.231920 0.229239 0.210773 0.253398 0.236199 0.219650 0.246367 0.209087 0.220856 0.215677 0.212112 0.215022 0.213763 0.211109
chargesum: 0.00000
title: Mulliken charges with hydrogens summed into heavy atoms:
elementType: N C C C C C C C C C
charge: -0.022567 0.090490 0.134858 0.189277 -0.054478 -0.021263 -0.041259 -0.018799 -0.024341 -0.231920
polarizability: 1.07361289e+02 6.75877384e-01 8.23267459e+01 -4.37239038e+00 -1.46901378e-02 8.24750040e+01
1716.lowfreq: -16.5697 -0.0002 0.0003 0.0008 9.2527 26.8496 59.9921 139.8883 162.1973
frequency: 59.2885 139.8387 162.1894 269.6388 289.0277 341.4410 357.8066 431.8268 490.9347 541.5659 567.0421 629.8668 750.2716 791.0853 803.7512 815.5021 843.5308 869.4180 908.1119 919.7313 959.2698 971.7546 1014.7885 1042.7354 1059.4648 1078.0210 1087.1138 1105.3993 1124.8968 1149.9308 1187.5801 1220.8977 1229.7584 1235.6276 1255.9307 1285.6726 1302.9991 1310.8154 1318.3222 1323.0182 1324.3412 1332.1374 1353.2452 1357.3814 1466.9901 1470.8204 1477.6108 1480.0787 1498.2372 2182.2016 2977.6660 2982.6962 2984.2022 2992.1970 2997.3215 3000.3027 3017.8597 3026.9845 3030.9598 3034.3108 3052.9490 3060.8602 3063.5035
redmass: 2.9936 4.6389 2.6667 1.9158 2.5618 2.4059 2.7531 4.1033 4.0932 6.4087 4.0305 5.6377 2.2691 1.9539 2.1253 1.7729 1.8615 2.5774 2.1635 2.0657 2.0176 2.9455 2.9144 2.5034 2.2480 1.8380 1.8708 1.6182 1.0797 1.0346 1.1786 1.2651 1.1530 1.2479 1.5218 1.5368 1.3834 1.6300 1.4096 1.3852 1.6043 1.5045 1.4136 1.4263 1.0760 1.0788 1.0821 1.0853 1.0893 12.5466 1.0604 1.0600 1.0812 1.0649 1.0633 1.0632 1.0822 1.0965 1.0958 1.0985 1.1041 1.1033 1.1039
irintensity: 2.4007 3.4886 1.5351 0.1225 0.1282 0.0608 0.1354 0.1742 0.5721 0.5937 1.0008 0.6938 0.3478 0.5975 2.1337 4.5993 7.3400 2.3625 5.3007 1.3605 0.4690 1.5602 0.8598 0.2002 0.1154 0.5464 0.3477 0.6040 0.6345 0.4785 0.5443 1.7253 0.0738 1.0562 8.4892 4.0869 2.1254 0.0029 0.2308 0.1216 0.1419 1.5413 1.8305 1.3093 0.6834 7.6044 13.6706 17.0676 3.4447 21.4663 26.0280 14.2346 5.5472 35.1480 62.6017 47.4569 117.6833 12.4154 6.0843 3.0145 14.7245 95.6446 46.0012
temp: 298.150 k
press: 1.00000 atm
elementType: 7 6 6 6 6 6 6 6 6 6 1 1 1 1 1 1 1 1 1 1 1 1 1
symmnumber: 1
zpe: 528813.6 jmol-1
zpe.correction: 0.201414 hartree
zpe.thermalcorrener: 0.210044 hartree
zpe.thermalcorrenthalpy: 0.210988 hartree
zpe.thermalcorrgfe: 0.167870 hartree
zpe.sumelectzpe: -404.727861 hartree
zpe.sumelectthermal: -404.719232 hartree
zpe.sumelectthermalent: -404.718288 hartree
zpe.sumelectthermalfe: -404.761406 hartree
dipole: 4.3993 0.1929 -0.9631
dipole: 4.5076
quadrupole: -78.2174 -58.7955 -58.6326
quadrupole: -0.4833 2.2715 0.0790
quadrupole: -13.0022 6.4196 6.5826 -0.4833 2.2715 0.0790
hfenergy: -404.9292758 hartree
pointgroup: C01 [X(C9H13N1)]
dipole: 1.7407413 -0.0338748 0.3372542 debye
dipolederiv: -0.4202235 -0.0124517 0.0341398 0.0052012 -0.2259353 -0.0011833 -0.0631103 -0.00121 -0.2310173 0.1218032 -0.0270175 -0.0477699 -0.1172741 0.1475734 0.0063643 -0.1123392 0.0231077 0.0976073 0.1060376 0.0071268 0.0036156 -0.029862 0.1060963 -0.0117741 -0.0294732 -0.0073102 0.0889859 -0.0464255 0.0449403 -0.0254048 0.0234606 0.0905128 -0.044838 -0.0417096 -0.0382425 0.1820106 0.0047746 0.0267542 0.0208009 0.1205997 0.1322247 0.0321694 0.0327184 0.0274554 0.0947107 0.0670659 -0.0140385 0.0079164 -0.0020138 0.056755 0.0397918 0.0169666 0.0539326 0.0075326 -0.0004902 -0.0264532 -0.0427268 0.0240153 0.0827138 -0.0093464 -0.0149647 -0.0239868 0.0919614 0.1026269 -0.0239685 -0.0270041 -0.014432 0.0769515 -0.0384608 -0.03805 -0.0577942 0.00938 0.0917508 0.0420917 -0.0314209 0.0303053 0.0102371 0.04109 -0.00759 0.050898 0.0953632 0.3148125 0.0067075 0.0423134 -0.0114165 -0.114834 0.0036363 0.1676605 -0.011485 -0.0481929 -0.0160604 -0.1088765 0.0028541 -0.0933342 -0.1294634 -0.0007765 0.0050452 -0.0029726 0.0383633 -0.0397127 -0.1096681 -0.0095904 -0.1094044 -0.1621419 -0.0127277 0.0034166 -0.0099061 0.0425957 0.0211102 -0.0086591 -0.0104773 -0.0220044 0.0462293 0.0487512 0.0163227 0.0573188 -0.092671 -0.0174388 0.0800412 -0.0553186 0.0658158 -0.0280505 0.0491787 -0.073596 0.0988421 0.0276569 0.0434497 -0.0426527 -0.0070127 -0.029866 0.0111527 -0.0630522 0.010701 -0.1168505 -0.1458783 -0.1021537 -0.0087005 -0.1128331 0.0269832 0.0392098 0.0401283 -0.0911644 0.0216881 0.0269454 0.0119209 0.0763788 0.0922168 0.0403789 -0.0769714 -0.1180731 0.0696021 -0.0893224 -0.0167281 -0.0515838 0.089153 0.0566167 0.0698534 -0.0548832 -0.0621324 0.0730813 -0.1176732 0.0135113 0.0586674 -0.0472829 0.0273811 -0.0179575 -0.0107443 0.0822054 -0.0050625 0.1342301 -0.1442658 -0.1567243 -0.0132992 0.1273107 0.0369334 0.0422966 -0.0375031 0.0882299 -0.0180431 0.0156694 0.023809 0.081943 -0.0872349 0.0294132 -0.0916714 0.1203701 -0.051631 0.0867868 -0.0200592 0.0728631 -0.0083472 -0.002578 -0.0344464 0.0162974 -0.0529377 -0.0676656 -0.0616586 -0.1868876 -0.1898789 -0.0037207 0.0442061 0.0090516 0.0364452 -0.0108802 0.1126121 0.0021956 0.0534065 unknown
polarizability: 107.5757662|-0.0754678|82.310552|3.7654977|0.0862105|82.2767209 unknown
InChI: InChI=1S/C9H13N/c10-6-9-5-7-1-3-8(9)4-2-7/h7-9H,1-5H2
charge 0 multiplicity 1
23 atoms
N  -3.320589 -0.025503 -0.043748
C  0.05779 -1.153569 -0.071132
C  1.312049 1.13923 0.030943
C  -0.78023 -0.123824 0.765337
C  -0.084503 1.291864 0.687055
C  0.274287 -0.606495 -1.505805
C  1.427333 -1.33098 0.635908
C  1.136959 0.699193 -1.447107
C  2.12899 0.061615 0.792715
C  -2.185145 -0.071206 0.323948
H  -0.480616 -2.118799 -0.108083
H  1.839968 2.1112 0.074695
H  -0.78622 -0.473397 1.817676
H  -0.700988 1.989856 0.092182
H  0.004552 1.720062 1.702123
H  -0.706288 -0.413467 -1.979941
H  0.774345 -1.380454 -2.11698
H  2.050511 -2.016193 0.031092
H  1.286831 -1.815006 1.621247
H  2.134328 0.53109 -1.896216
H  0.65724 1.509354 -2.027691
H  2.210028 0.343492 1.860347
H  3.160069 0.025935 0.394234
