program: Gaussian 09
title: 000243827
version: EM64L-G09RevD.01
frameworkgroup: C1[X(C9H10ClN)]
method: RPBEPBE
basis: SDD
operation: Freq
keyword: #p
keyword: freq=noraman
keyword: PBEPBE/SDD
title: #p freq=noraman PBEPBE/SDD
converged: YES YES NO NO
title: Mulliken charges:
elementType: Cl N C C C C C C C C C H H H H H H H H H H
charge: -0.019789 0.000236 -0.240798 -0.191285 -0.102241 -0.481443 -0.474292 -0.446502 -0.178990 -0.203448 -0.121283 0.277656 0.235335 0.245300 0.278626 0.237906 0.252086 0.223039 0.233968 0.239492 0.236427
chargesum: 0.00000
title: Mulliken charges with hydrogens summed into heavy atoms:
elementType: Cl N C C C C C C C C C
charge: -0.019789 0.000236 0.036858 0.044050 -0.102241 0.042483 0.015700 0.010505 0.060502 0.032979 -0.121283
polarizability: 1.05921423e+02 3.97206168e+00 1.07804741e+02 -4.66878232e+00 8.80538588e-01 8.50911854e+01
1716.lowfreq: -12.6852 -6.6466 -0.0015 -0.0013 -0.0006 14.6525 75.8409 130.8663 156.2071
frequency: 75.7216 130.8513 156.2051 219.2333 225.9521 309.0023 353.0147 361.0783 386.2042 455.6431 492.1039 546.3872 605.4484 624.6638 654.4884 703.5676 758.7906 809.6558 816.9136 857.2144 896.1858 946.6995 960.3364 964.4132 974.6936 1007.8833 1027.0836 1046.4059 1069.5280 1099.8892 1127.8211 1168.7972 1184.0393 1215.1260 1227.1826 1243.2427 1277.0491 1300.0366 1305.7642 1325.4147 1341.0432 1361.7259 1455.2484 1468.4987 1484.0523 1632.2148 2180.9675 2997.1454 3014.1171 3017.5098 3049.3773 3056.8020 3077.2996 3080.2213 3093.3561 3143.1794 3176.2527
redmass: 3.8996 6.2511 11.0557 2.4911 4.0963 4.8398 2.8854 1.9817 4.3313 6.9736 6.2254 6.0198 5.1091 4.0354 4.6650 1.5739 3.4573 1.3807 2.9169 2.6069 2.4597 1.4292 2.9267 2.1836 2.4075 2.2575 2.7273 2.9419 2.6180 2.0163 1.0666 1.1640 1.3851 1.2774 1.2070 1.4925 1.4110 1.2822 1.3929 1.4034 1.5799 1.7794 1.0744 1.0762 1.0888 5.9911 12.6530 1.0610 1.0628 1.0637 1.0876 1.1017 1.0906 1.1006 1.1010 1.0875 1.1051
irintensity: 0.9784 1.2910 4.8027 1.0471 2.9375 4.6668 0.3936 0.4953 0.0448 9.4046 2.0494 0.5142 2.2035 1.1027 10.7423 78.8142 6.0163 12.6837 3.1859 11.6378 2.9824 0.8653 10.7671 8.4164 5.0943 3.9515 4.9385 5.3024 1.4919 5.8257 0.9468 7.6627 1.6469 2.7300 4.2005 1.9342 1.3218 0.0778 2.1956 1.0968 4.4354 5.6032 11.0272 8.3399 9.7584 0.9480 3.0272 27.5700 34.9003 12.8648 43.2676 6.0644 17.9937 31.2365 5.8386 6.7279 20.5582
temp: 298.150 k
press: 1.00000 atm
elementType: 17 7 6 6 6 6 6 6 6 6 6 1 1 1 1 1 1 1 1 1 1
symmnumber: 1
zpe: 439859.4 jmol-1
zpe.correction: 0.167534 hartree
zpe.thermalcorrener: 0.177047 hartree
zpe.thermalcorrenthalpy: 0.177991 hartree
zpe.thermalcorrgfe: 0.132753 hartree
zpe.sumelectzpe: -862.917874 hartree
zpe.sumelectthermal: -862.908360 hartree
zpe.sumelectthermalent: -862.907416 hartree
zpe.sumelectthermalfe: -862.952654 hartree
dipole: -4.4168 -1.2290 0.3140
dipole: 4.5954
quadrupole: -78.6142 -78.2452 -66.6679
quadrupole: -4.7735 -1.2386 0.2476
quadrupole: -4.1051 -3.7361 7.8412 -4.7735 -1.2386 0.2476
hfenergy: -863.0854072 hartree
pointgroup: C01 [X(C9H10Cl1N1)]
dipole: -1.7850702 -0.2333892 -0.166637 debye
dipolederiv: -0.3081409 -0.1535828 -0.0045946 -0.1310301 -0.6420137 -0.0049077 0.0017965 -0.0044036 -0.1801449 -0.2567306 0.021649 -0.001206 0.0526037 -0.2164317 0.0114798 -0.0144502 0.0093509 -0.2032857 0.1234754 0.0391279 0.0624278 0.0201196 -0.1505583 -0.0082213 -0.0540066 -0.030751 0.120724 0.0850464 0.0786611 0.065884 0.0797394 0.0337185 -0.0094625 0.0112415 -0.0044987 0.1586432 0.4053155 0.2312844 -0.0084851 0.2308707 0.8334792 0.0271884 -0.0408598 -0.0162593 0.2825173 0.0169746 -0.0172287 -0.0185321 0.0031273 -0.0360297 -0.0107346 -0.001173 0.0126493 -0.0216912 -0.0025312 -0.0393137 -0.0540861 0.0034982 0.0683323 -0.0229452 0.0450736 0.0910534 0.0344971 0.1174911 0.0085947 -0.019701 -0.001277 0.0676122 0.0416453 -0.0356404 -0.0037378 -0.0108853 0.0059152 -0.1354745 0.0109033 -0.1329428 -0.0528477 0.1206021 0.0736452 0.0763944 -0.0970182 -0.0322374 -0.1494348 0.0357184 -0.1814033 -0.0705539 0.1141661 0.0243375 0.1190673 -0.0297399 -0.0294838 -0.0832144 -0.0079441 -0.1712563 -0.0211616 -0.0253498 0.0546122 -0.0262672 -0.0765745 0.0089017 -0.0246007 -0.07524 -0.022785 0.0541738 -0.040696 -0.0667781 -0.0201756 -0.0613969 -0.0299609 -0.0270487 -0.1075421 -0.0214211 0.0524123 -0.0126954 -0.0949617 -0.0161656 -0.1138332 -0.0099675 0.0432162 0.0696824 0.0625349 -0.00499 -0.1092237 0.045277 -0.0717257 0.0222884 0.0462115 -0.0169691 -0.025212 -0.0262271 -0.0242043 0.0893136 -0.0063765 0.0525622 0.0477648 -0.0094174 -0.0608405 0.1039859 -0.0646493 0.0300724 0.0211593 0.0570721 0.0392943 -0.0735694 -0.0441909 0.1058353 -0.055465 0.1187093 -0.0066671 0.0262917 -0.0192696 -0.017398 0.0648765 0.0285497 0.1085796 0.0722545 0.0467135 -0.0610566 -0.0976778 0.0258194 -0.0899161 -0.0167979 -0.1256791 -0.1238702 0.0032982 -0.0752496 0.0243208 0.0218069 0.0378584 0.0236887 0.0447187 0.0483193 0.0684467 -0.0024005 0.0841472 0.0476784 -0.10624 0.0224311 -0.1084354 0.0258183 -0.0378606 0.1261832 -0.0437459 0.1261778 0.0747147 -0.0254993 -0.0656489 -0.0143266 0.083089 unknown
polarizability: 108.8595368|-3.500121|104.6622284|4.5281739|2.5487502|85.295584 unknown
InChI: InChI=1S/C9H10ClN/c10-9(6-11)5-7-1-3-8(9)4-2-7/h1,3,7-8H,2,4-5H2
charge 0 multiplicity 1
21 atoms
Cl 1.348283 2.252686 0.023387
N  2.994637 -1.030322 0.040149
C  -0.185177 0.129172 1.131667
C  -1.472335 -0.288312 -1.095852
C  0.758803 0.408465 -0.08862
C  -0.020203 0.187456 -1.427049
C  -0.601898 -1.383205 1.035941
C  -1.36291 -1.635658 -0.305797
C  -1.437504 0.974117 0.967404
C  -2.118194 0.747138 -0.188758
C  2.00247 -0.368728 -0.016808
H  0.353295 0.332282 2.070749
H  -2.033081 -0.431581 -2.035475
H  0.49872 -0.568069 -2.044299
H  -0.042639 1.130021 -1.996267
H  -1.246055 -1.605765 1.903608
H  0.292058 -2.028065 1.118782
H  -0.826968 -2.378258 -0.926522
H  -2.373907 -2.034705 -0.114609
H  -1.737119 1.694488 1.733394
H  -3.043379 1.262944 -0.464727
