program: Gaussian 09
title: 000243814
version: EM64L-G09RevD.01
frameworkgroup: C1[X(C22H19NO)]
method: RPBEPBE
basis: SDD
operation: Freq
keyword: #p
keyword: freq=noraman
keyword: PBEPBE/SDD
title: #p freq=noraman PBEPBE/SDD
converged: YES YES NO NO
title: Mulliken charges:
elementType: O N C C C C C C C C C C C C C C C C C C C C C C H H H H H H H H H H H H H H H H H H H
charge: -0.318077 -0.015144 0.017252 0.377090 0.310053 0.355280 -0.368229 -0.331535 -0.396862 -0.394297 -0.411329 -0.356515 -0.239379 -0.250518 -0.251919 -0.253693 -0.266516 -0.221227 -0.241990 -0.463293 -0.242319 -0.245209 -0.243274 -0.147213 0.263854 0.233777 0.259470 0.270120 0.276758 0.250854 0.242364 0.219931 0.229523 0.226233 0.228291 0.232051 0.224582 0.227263 0.264326 0.257694 0.232570 0.227734 0.231467
chargesum: 0.00000
title: Mulliken charges with hydrogens summed into heavy atoms:
elementType: O N C C C C C C C C C C C C C C C C C C C C C C
charge: -0.318077 -0.015144 0.017252 0.377090 0.310053 0.355280 -0.104374 -0.097758 -0.137392 -0.124177 -0.134571 -0.105661 0.222916 -0.020995 -0.025686 -0.025402 -0.034464 0.003356 -0.014727 0.058727 -0.009750 -0.017475 -0.011807 -0.147213
polarizability: 2.35347648e+02 -7.38131684e+00 2.35693780e+02 1.82134835e+01 2.21115491e+00 2.29649136e+02
1716.lowfreq: -4.2419 -0.0011 -0.0008 -0.0006 5.2993 9.6071 20.5521 31.8119 47.1740
frequency: 20.5054 31.7649 47.1712 50.9308 62.7475 69.3527 72.9790 84.9537 99.8954 141.3890 153.0019 212.1505 227.3287 252.9653 256.3562 271.5444 282.0419 309.8698 317.3229 356.9945 374.3816 399.7753 407.2011 417.7095 470.7284 480.0376 521.1632 538.4338 603.5190 615.6013 617.7183 618.7292 627.4364 643.4259 690.9978 701.2574 711.5013 716.8414 755.2874 768.5645 779.0110 802.2741 852.1621 862.8063 869.8755 893.0707 900.8015 912.8429 935.8765 945.7567 950.0100 958.3818 980.0139 988.0467 990.0259 991.3272 992.3325 996.0092 997.8887 1001.7705 1004.3538 1014.6670 1028.7756 1030.6918 1032.3136 1063.8668 1066.0916 1080.1225 1089.3178 1092.4106 1149.4532 1171.7298 1172.7396 1174.8940 1184.2906 1186.3114 1193.0924 1199.2039 1199.8937 1219.2742 1268.5687 1284.3184 1310.0303 1319.6921 1328.5284 1371.8691 1375.3205 1379.4914 1382.0557 1430.3780 1435.1756 1438.3478 1449.9344 1476.7557 1480.9654 1482.8380 1496.2782 1585.2647 1590.5390 1592.4216 1607.8546 1609.3382 1612.4046 2202.7229 2977.6497 3008.1648 3037.5806 3070.9177 3122.9041 3124.0124 3125.2915 3130.9546 3132.0910 3133.2453 3143.8229 3144.8859 3145.7351 3151.9561 3153.7810 3160.5523 3165.3455 3166.4469 3183.4459
redmass: 4.2255 6.9006 6.0480 4.5918 3.6920 3.4314 3.8033 4.6955 4.1573 2.9069 5.7463 4.6005 4.9008 5.5302 4.5830 4.4320 5.3282 5.4506 5.9178 5.5579 3.6688 2.8236 2.8725 2.9768 4.2325 3.6346 4.8904 4.1814 5.7416 6.3615 6.4063 6.4399 5.5735 5.7735 6.3032 1.8342 1.6365 1.8500 1.7014 2.1642 2.0025 1.1845 1.2548 1.2462 1.2519 3.1803 3.2296 4.5590 1.8477 1.5408 1.8424 3.6853 1.3954 1.4297 5.6964 4.2770 6.0379 1.4629 1.3191 1.3304 1.2985 8.2618 2.4379 2.1295 2.1378 2.7350 1.8373 1.5906 1.6165 1.6127 3.1215 1.0568 1.0607 1.0549 1.1683 1.2469 1.1223 2.6687 1.1311 4.0432 1.1080 1.3710 1.3817 1.3368 1.3329 2.7032 2.1120 5.7018 8.8705 2.2074 2.2421 2.2470 1.0787 2.1750 2.1808 2.1617 1.0814 5.8850 6.2531 6.3108 6.0570 5.9397 6.0600 12.4386 1.0564 1.0582 1.1053 1.1033 1.0845 1.0846 1.0848 1.0877 1.0883 1.0878 1.0925 1.0934 1.0924 1.0955 1.0956 1.0994 1.1013 1.1012 1.0942
irintensity: 0.1505 0.9862 1.1260 0.6782 2.1750 3.4024 0.4363 0.7489 0.1426 3.5811 3.5003 3.3763 2.2914 1.5405 3.7941 0.5401 0.7832 4.2748 6.2055 1.3925 1.6834 0.1494 0.1689 0.0096 8.8775 2.3110 6.0107 3.8081 4.1605 0.4524 0.3233 0.2213 30.4635 13.4193 2.6722 36.8573 90.1870 36.0329 45.6187 61.3643 36.6176 0.9906 0.2571 0.1736 0.0179 15.5381 10.2466 12.0926 0.4841 1.7253 0.6455 24.5802 0.0501 1.4449 1.6890 3.5166 1.2253 1.3460 0.1196 2.2004 1.2983 150.9926 0.9312 9.9824 9.3551 1.6389 3.5866 1.9359 4.3054 9.7590 5.2184 0.6685 0.4987 0.1682 0.8151 6.3094 5.9571 1.7909 2.7303 47.4213 2.4329 8.0538 2.6783 3.2540 0.3570 4.5432 5.5811 0.5559 0.3059 6.0282 16.1647 14.0115 11.6182 23.0684 8.6575 25.2119 3.0606 0.0937 0.5560 0.7568 6.8353 3.4304 1.9662 13.9411 24.7248 7.2002 17.4151 15.0934 1.9107 2.2811 0.8815 1.2661 9.4517 3.5337 36.8778 33.4268 2.6375 24.9669 27.2782 28.6687 29.9266 14.3201 6.8224
temp: 298.150 k
press: 1.00000 atm
elementType: 8 7 6 6 6 6 6 6 6 6 6 6 6 6 6 6 6 6 6 6 6 6 6 6 1 1 1 1 1 1 1 1 1 1 1 1 1 1 1 1 1 1 1
symmnumber: 1
zpe: 901656.7 jmol-1
zpe.correction: 0.343423 hartree
zpe.thermalcorrener: 0.364249 hartree
zpe.thermalcorrenthalpy: 0.365193 hartree
zpe.thermalcorrgfe: 0.291859 hartree
zpe.sumelectzpe: -978.014799 hartree
zpe.sumelectthermal: -977.993972 hartree
zpe.sumelectthermalent: -977.993028 hartree
zpe.sumelectthermalfe: -978.066363 hartree
dipole: -3.7070 0.5627 1.2507
dipole: 3.9526
quadrupole: -167.9307 -128.9558 -127.6835
quadrupole: 1.8493 7.5032 0.8901
quadrupole: -26.4073 12.5676 13.8398 1.8493 7.5032 0.8901
hfenergy: -978.3582216 hartree
pointgroup: C01 [X(C22H19N1O1)]
dipole: 0.9935282 -0.6568328 0.9998562 debye
polarizability: 221.7680566|-7.2465539|250.3371759|-10.9327374|-2.8201197|228.5853325 unknown
InChI: InChI=1S/C22H19NO/c23-17-10-18-24-22(19-11-4-1-5-12-19,20-13-6-2-7-14-20)21-15-8-3-9-16-21/h1-9,11-16H,10,18H2
charge 0 multiplicity 1
43 atoms
O  -0.727829 -0.119939 -1.259162
N  -3.881892 2.664174 -3.684588
C  0.090108 -0.06091 -0.001591
C  -0.873327 0.11407 1.193604
C  0.832006 -1.419717 0.040246
C  1.164002 1.05013 -0.136532
C  -1.488383 -1.023146 1.777639
C  1.665605 -1.724364 1.146488
C  1.752612 1.673541 0.992898
C  -1.276349 1.400602 1.639862
C  0.721039 -2.358816 -1.011496
C  1.666019 1.369511 -1.423707
C  -1.606428 1.02275 -1.518347
C  -2.458191 -0.881977 2.793199
C  2.373428 -2.94282 1.200669
C  2.802434 2.605916 0.836786
C  -2.245357 1.545294 2.656941
C  1.432837 -3.580381 -0.958596
C  2.710303 2.305075 -1.582626
C  -2.174898 0.762072 -2.930582
C  -2.838951 0.40394 3.241542
C  2.261978 -3.878596 0.14499
C  3.283835 2.930352 -0.451478
C  -3.118854 1.80963 -3.351137
H  -1.20437 -2.023284 1.434727
H  1.762594 -1.010146 1.971652
H  1.392764 1.437366 2.000064
H  -0.832611 2.297278 1.193852
H  0.07413 -2.13002 -1.861142
H  1.238269 0.865224 -2.296967
H  -2.423083 1.072138 -0.773715
H  -1.04052 1.975226 -1.493335
H  -2.916943 -1.774484 3.233113
H  3.012369 -3.160959 2.063781
H  3.243297 3.0774 1.722365
H  -2.539083 2.548002 2.986817
H  1.335865 -4.29834 -1.781093
H  3.081545 2.539963 -2.586545
H  -2.686551 -0.218289 -2.937626
H  -1.344099 0.702734 -3.658054
H  -3.589801 0.514467 4.031827
H  2.813682 -4.824537 0.184234
H  4.096701 3.654971 -0.572077
