program: Gaussian 09
title: 000243798
version: EM64L-G09RevD.01
frameworkgroup: C1[X(C15H19NO3)]
method: RPBEPBE
basis: SDD
operation: Freq
keyword: #p
keyword: freq=noraman
keyword: PBEPBE/SDD
title: #p freq=noraman PBEPBE/SDD
converged: YES YES NO NO
title: Mulliken charges:
elementType: O O O N C C C C C C C C C C C C C C C H H H H H H H H H H H H H H H H H H H
charge: -0.289562 -0.240290 -0.215388 -0.464658 -0.276416 -0.194517 -0.429794 -0.423340 -0.413968 -0.413124 0.169798 0.192467 0.486235 -0.502399 -0.453707 -0.351261 -0.197156 -0.213573 -0.255673 0.258995 0.249064 0.203054 0.215141 0.221972 0.214683 0.195176 0.252542 0.200368 0.231422 0.315112 0.243702 0.243810 0.231840 0.220299 0.306815 0.226194 0.226967 0.229170
chargesum: 0.00000
title: Mulliken charges with hydrogens summed into heavy atoms:
elementType: O O O N C C C C C C C C C C C C C C C
charge: -0.289562 -0.240290 -0.215388 -0.149547 -0.017421 0.054546 -0.011600 0.013315 0.033750 0.018666 0.169798 0.192467 0.486235 0.216954 -0.233408 -0.044446 0.029039 0.013394 -0.026503
polarizability: 2.35654508e+02 -8.90785700e+00 1.82703488e+02 -9.99876825e+00 -1.26200426e+00 1.13231436e+02
1716.lowfreq: -0.0010 -0.0010 -0.0007 7.2123 7.9940 13.8033 26.9494 28.3966 42.5512
frequency: 25.4037 27.9601 42.3260 49.6226 75.8936 103.4245 113.7135 119.2067 138.2102 176.1215 179.5519 235.1208 251.1705 259.8450 310.3605 312.0376 337.9302 347.5746 368.3971 408.1721 444.0790 479.9634 510.8233 548.6049 582.6466 610.1780 614.9228 660.1928 680.7465 697.3792 731.4722 747.7135 769.3614 783.3067 798.1569 825.7965 843.1170 848.7605 873.3044 876.7304 917.6666 920.7214 936.1696 958.9457 972.6836 984.5292 1000.6456 1003.6681 1026.3626 1059.3139 1069.4924 1087.7928 1091.9550 1105.3121 1114.1533 1126.2618 1147.2042 1148.4271 1161.9263 1172.0339 1172.7795 1187.4347 1244.1660 1258.8752 1266.4457 1278.0510 1284.5495 1315.6136 1321.4514 1334.5355 1340.2826 1354.6571 1355.0382 1370.0400 1384.5247 1423.5441 1426.3026 1452.6650 1458.3035 1462.7011 1465.6051 1470.8273 1478.4846 1484.7262 1509.7319 1598.8713 1614.4247 1625.2345 1644.6711 2969.7113 2973.0353 2986.9745 2993.7589 2996.2399 3000.5701 3005.0929 3042.0992 3043.0360 3054.5463 3070.6333 3107.3658 3108.0182 3132.0222 3144.4193 3147.8349 3165.2831 3197.1765 3509.0639
redmass: 4.2383 5.1711 5.8641 4.8586 5.8109 1.4779 1.8173 4.1633 4.1965 3.3801 3.9282 3.5856 3.4942 3.3975 4.4669 3.5603 2.3409 4.5482 4.9362 2.9253 2.7455 3.5558 2.8937 3.5533 5.0462 4.9715 6.1854 1.1739 4.0216 1.9829 4.0657 3.2132 1.7297 2.4104 3.5400 4.0988 1.2716 2.9017 2.8764 2.9147 1.4364 2.1037 2.4470 3.8599 1.3511 6.1180 1.3118 2.7372 2.1581 1.9337 1.8485 1.6020 2.0188 1.5683 1.2717 2.3232 1.5167 1.4230 1.4549 1.1274 2.4141 1.1163 1.3305 1.9871 1.4341 1.2765 1.3856 1.4871 1.5825 1.4950 1.3801 1.4283 1.5115 1.5607 4.5198 1.1732 2.3527 1.0497 1.0850 1.0857 1.0509 1.0902 1.0911 2.3412 2.0668 6.2429 5.5840 4.5981 9.5428 1.0655 1.0776 1.0604 1.0673 1.0746 1.0695 1.0295 1.0997 1.0973 1.1022 1.1008 1.1046 1.0888 1.0867 1.0933 1.1050 1.0999 1.0950 1.0762
irintensity: 0.4995 0.9032 0.2376 1.2533 3.0265 0.4015 0.0465 0.5061 2.3903 6.9443 2.7249 4.5168 0.6673 11.2767 14.0084 2.3040 1.9979 2.1100 3.4475 0.0337 4.6941 1.4166 21.9124 2.5170 7.2383 0.5661 0.6497 34.8447 5.3752 56.0006 1.6726 1.7375 91.1008 2.2431 1.8450 2.3111 0.5501 39.1197 4.7670 7.7135 13.4518 9.4168 5.2846 16.5549 0.1396 0.2217 3.2369 44.3064 7.5476 3.1933 21.1619 6.0601 80.6173 6.4271 2.6092 158.4041 31.9941 17.7721 27.6236 4.4630 62.1165 2.2582 1.4181 36.7681 10.0234 3.6578 43.8722 68.1520 5.4163 5.5424 1.6713 1.9126 2.0983 10.6095 65.9014 15.7336 100.2853 12.9518 5.6175 19.4746 10.4694 16.1424 32.1861 63.5121 353.3536 60.2818 58.5696 79.0397 161.3925 30.8816 12.2199 11.5176 46.0010 82.4909 19.0923 35.0581 27.0640 42.3440 13.7672 45.6833 24.0823 15.2196 0.4790 29.9260 14.7115 26.3326 7.2915 11.7128
temp: 298.150 k
press: 1.00000 atm
elementType: 8 8 8 7 6 6 6 6 6 6 6 6 6 6 6 6 6 6 6 1 1 1 1 1 1 1 1 1 1 1 1 1 1 1 1 1 1 1
symmnumber: 1
zpe: 825698.3 jmol-1
zpe.correction: 0.314492 hartree
zpe.thermalcorrener: 0.332618 hartree
zpe.thermalcorrenthalpy: 0.333562 hartree
zpe.thermalcorrgfe: 0.266305 hartree
zpe.sumelectzpe: -862.020665 hartree
zpe.sumelectthermal: -862.002539 hartree
zpe.sumelectthermalent: -862.001595 hartree
zpe.sumelectthermalfe: -862.068852 hartree
dipole: -0.1324 4.0494 -0.7067
dipole: 4.1127
quadrupole: -112.8928 -104.1571 -114.8548
quadrupole: 1.5246 -8.3017 -3.7234
quadrupole: -2.2579 6.4778 -4.2199 1.5246 -8.3017 -3.7234
hfenergy: -862.3351569 hartree
pointgroup: C01 [X(C15H19N1O3)]
dipole: -0.1140618 -1.5946329 0.2496382 debye
polarizability: 235.7335891|6.8500061|182.1719527|12.6836735|-0.344269|113.6838901 unknown
InChI: InChI=1S/C15H19NO3/c1-19-15(18)13-10-6-5-9-12(13)14(17)16-11-7-3-2-4-8-11/h2-4,7-8,12-13,16H,5-6,9-10H2,1H3
charge 0 multiplicity 1
38 atoms
O  2.481396 -2.271819 0.381792
O  -0.635123 1.99843 0.600744
O  4.110735 -1.058931 -0.751924
N  -1.19066 -0.270685 0.37411
C  1.15727 0.285969 0.801678
C  1.779197 -0.175266 -0.573022
C  2.048957 1.341017 1.505262
C  2.200567 1.023176 -1.457391
C  2.456081 2.521331 0.591612
C  3.116909 2.022878 -0.713371
C  -0.290691 0.779935 0.585955
C  2.932887 -1.154729 -0.344385
C  -2.586718 -0.218312 0.092387
C  3.496342 -3.322049 0.6405
C  -3.259668 -1.456304 -0.099242
C  -3.314216 0.998777 -0.002337
C  -4.63968 -1.480596 -0.38295
C  -4.696189 0.95609 -0.28845
C  -5.368935 -0.272221 -0.480482
H  1.09873 -0.612446 1.448011
H  1.010118 -0.766673 -1.112714
H  2.964915 0.827581 1.864503
H  1.518573 1.722252 2.397531
H  1.281422 1.547039 -1.785761
H  2.708308 0.645217 -2.363755
H  3.155599 3.180808 1.140731
H  1.555176 3.115329 0.356677
H  3.334485 2.880796 -1.377699
H  4.084571 1.533614 -0.491447
H  -0.792737 -1.212612 0.430672
H  4.336407 -2.906579 1.221847
H  3.88113 -3.722777 -0.312328
H  2.963716 -4.096089 1.210675
H  -2.70128 -2.399205 -0.027454
H  -2.794266 1.94567 0.150713
H  -5.144027 -2.442263 -0.528608
H  -5.250669 1.898624 -0.359874
H  -6.441334 -0.289676 -0.701607
