program: Gaussian 09
title: 000243792
version: EM64L-G09RevD.01
frameworkgroup: C1[X(C13H16O3)]
method: RPBEPBE
basis: SDD
operation: Freq
keyword: #pfreq=noraman
keyword: PBEPBE/SDD
title: #p freq=noraman PBEPBE/SDD
converged: YES YES NO NO
title: Mulliken charges:
elementType: O O O C C C C C C C C C C C C C H H H H H H H H H H H H H H H H
charge: -0.266200 -0.219472 -0.258536 -0.167630 -0.531113 -0.715709 0.099023 0.259306 0.301644 -0.351524 -0.361620 -0.264382 -0.249219 -0.225978 -0.223728 -0.660282 0.282117 0.245563 0.234889 0.225783 0.219218 0.244485 0.266669 0.270152 0.223065 0.232474 0.230934 0.231575 0.231319 0.215260 0.250763 0.231159
chargesum: 0.00000
title: Mulliken charges with hydrogens summed into heavy atoms:
elementType: O O O C C C C C C C C C C C C C
charge: -0.266200 -0.219472 -0.258536 0.114486 -0.050660 -0.026224 0.099023 0.259306 0.301644 -0.084855 -0.091469 0.191157 -0.018285 0.005596 0.007591 0.036899
polarizability: 1.80640809e+02 -2.39944197e+01 1.31389742e+02 1.42815836e+00 -1.46303725e+01 1.28973758e+02
1716.lowfreq: -5.3903 -4.5850 0.0001 0.0007 0.0007 3.8952 12.2825 27.9164 44.1446
frequency: 11.3667 27.9068 44.1373 57.5880 71.0158 81.8790 116.9894 154.0131 174.5035 211.0877 217.9348 236.2892 269.9791 296.0046 334.4573 359.4616 385.8667 402.2349 418.3250 468.4791 491.7452 575.5896 609.8642 613.8962 672.0116 697.0306 706.5744 757.3796 762.0496 799.7547 817.8374 848.6749 857.4602 894.2259 931.7485 950.3888 984.9082 991.4399 997.6109 1004.8659 1010.7215 1027.8911 1062.3360 1072.8678 1088.1595 1095.9079 1114.8275 1146.4071 1157.4297 1173.1743 1185.0278 1194.9392 1244.7031 1277.8138 1279.3201 1311.6821 1323.6556 1345.0576 1359.1166 1385.5220 1387.5414 1392.1595 1433.6730 1443.7256 1458.2114 1463.0451 1474.7482 1479.1986 1484.0317 1484.7034 1562.4322 1592.0168 1609.0295 1622.3252 2986.2897 2993.9727 2997.7486 3026.2571 3029.7662 3082.5262 3089.5202 3092.6624 3093.9901 3100.4456 3120.0298 3127.6586 3139.3243 3151.8459 3161.4756 3170.2491
redmass: 5.0033 4.0030 4.1729 3.8875 4.7805 3.4681 5.2656 4.2088 2.3511 2.4524 1.6445 1.2938 2.1266 3.1928 3.3786 3.9570 4.4625 2.7991 3.5959 3.4557 3.5776 3.0341 4.5345 6.1820 5.4791 1.7420 4.9532 2.0906 2.5552 3.3718 1.5260 2.7582 1.2504 1.7962 1.6278 1.6160 1.8357 2.8853 3.2547 1.3701 2.6421 2.0017 2.2317 2.4134 1.5952 2.2057 3.3927 1.7670 1.6699 1.0646 1.3192 1.2627 1.9933 1.3069 1.2879 1.4603 1.4384 1.4711 1.3989 8.7273 1.2117 1.2326 1.9920 1.2099 1.0934 1.0468 1.0543 2.0013 1.0716 1.0659 7.7726 6.5371 6.1815 8.6926 1.0355 1.0362 1.0657 1.0828 1.0599 1.1000 1.0973 1.0943 1.1035 1.1002 1.1059 1.0852 1.0886 1.0930 1.0959 1.1004
irintensity: 1.3328 1.0866 2.3039 1.0663 2.3126 2.0737 1.2730 0.8572 0.9393 2.3046 5.9126 1.0608 1.8157 3.4173 20.4524 4.5212 0.8704 0.5209 14.8671 2.4834 0.8648 15.2526 5.8842 1.2227 3.8702 63.3650 2.4816 36.4808 16.9975 7.8157 5.0591 8.2596 0.1557 2.8617 1.8624 14.6026 0.3630 0.0818 26.0419 4.6013 32.8982 4.8591 38.9301 7.3337 6.2469 49.8326 249.0297 99.3660 13.3446 1.5851 14.5890 38.9269 65.2592 39.3914 52.2590 26.9846 35.7215 29.8314 6.8186 3.9368 16.8227 17.9104 16.1255 25.8550 13.0518 12.4386 16.7962 5.3847 2.7645 23.5774 115.1976 20.8044 9.4518 170.9096 29.1560 17.6625 13.0036 6.6649 30.4626 16.5841 33.8000 17.4128 0.2011 25.2869 32.9226 0.2175 10.8359 13.0086 15.9638 21.4601
temp: 298.150 k
press: 1.00000 atm
elementType: 8 8 8 6 6 6 6 6 6 6 6 6 6 6 6 6 1 1 1 1 1 1 1 1 1 1 1 1 1 1 1 1
symmnumber: 1
zpe: 684334.2 jmol-1
zpe.correction: 0.260649 hartree
zpe.thermalcorrener: 0.277092 hartree
zpe.thermalcorrenthalpy: 0.278037 hartree
zpe.thermalcorrgfe: 0.213681 hartree
zpe.sumelectzpe: -729.465358 hartree
zpe.sumelectthermal: -729.448915 hartree
zpe.sumelectthermalent: -729.447971 hartree
zpe.sumelectthermalfe: -729.512326 hartree
dipole: 0.6565 0.8528 -1.8798
dipole: 2.1661
quadrupole: -77.7848 -89.2559 -98.6709
quadrupole: -0.2176 0.1705 3.7041
quadrupole: 10.7858 -0.6854 -10.1004 -0.2176 0.1705 3.7041
hfenergy: -729.7260073 hartree
pointgroup: C01 [X(C13H16O3)]
dipole: -0.1856909 0.1354723 -0.82061 debye
polarizability: 175.5564533|-28.2221792|124.3523726|-10.2784696|7.630295|141.0954833 unknown
InChI: InChI=1S/C13H16O3/c1-3-16-13(15)10(2)9-12(14)11-7-5-4-6-8-11/h4-8,10H,3,9H2,1-2H3
charge 0 multiplicity 1
32 atoms
O  -3.452278 0.142006 -0.138947
O  0.26562 0.227648 2.393773
O  -1.482755 0.193212 -1.384287
C  -1.713207 1.603301 0.649536
C  -0.177488 1.786272 0.596033
C  -2.464019 2.943955 0.421865
C  0.587291 0.613607 1.228231
C  -2.157075 0.581362 -0.398097
C  1.74144 -0.014932 0.506228
C  1.860582 0.009786 -0.910159
C  2.73034 -0.686489 1.277926
C  -4.027406 -0.867915 -1.084124
C  2.958816 -0.617175 -1.537836
C  3.83279 -1.296755 0.649169
C  3.951047 -1.260889 -0.762207
C  -3.639292 -2.285149 -0.654219
H  -1.990187 1.206865 1.643939
H  0.147628 1.989408 -0.436046
H  0.079611 2.676203 1.205093
H  -2.1919 3.664286 1.213836
H  -2.196806 3.388312 -0.554457
H  -3.555962 2.790898 0.45066
H  1.071082 0.463455 -1.517277
H  2.609195 -0.713807 2.366061
H  -5.113448 -0.695634 -1.016378
H  -3.66538 -0.641983 -2.102525
H  3.037258 -0.610098 -2.630487
H  4.597763 -1.800283 1.250451
H  4.807021 -1.737856 -1.253168
H  -4.140044 -3.023347 -1.308014
H  -2.549859 -2.435374 -0.736435
H  -3.948678 -2.478991 0.387063
