program: Gaussian 09
title: 000243766
version: EM64L-G09RevD.01
frameworkgroup: C1[X(C6H2ClF3N4)]
method: RPBEPBE
basis: SDD
operation: Freq
keyword: #p
keyword: freq=noraman
keyword: PBEPBE/SDD
title: #p freq=noraman PBEPBE/SDD
converged: NO NO NO NO
title: Mulliken charges:
elementType: Cl F F F N N N N C C C C C C H H
charge: 0.038772 -0.135390 -0.147574 -0.146259 0.035794 -0.391619 0.104315 0.031893 0.273583 0.133084 -0.096503 -0.311093 -0.383448 0.339472 0.291445 0.363527
chargesum: 0.00000
title: Mulliken charges with hydrogens summed into heavy atoms:
elementType: Cl F F F N N N N C C C C C C
charge: 0.038772 -0.135390 -0.147574 -0.146259 0.035794 -0.028091 0.104315 0.031893 0.273583 0.133084 -0.096503 -0.311093 -0.092003 0.339472
polarizability: 1.31464137e+02 -2.57352934e+00 1.23950402e+02 4.98381266e-02 2.45019897e-03 4.66627705e+01
1716.lowfreq: -4.1331 -0.0011 -0.0004 0.0017 5.2152 7.7747 24.7748 83.4310 130.0901
frequency: 24.0237 83.4286 130.0900 133.2060 195.0481 214.8058 263.1373 288.2228 301.1486 375.6579 395.0589 464.8093 480.0789 539.8163 594.0747 595.4736 633.6224 636.3665 671.6257 716.4241 746.9981 799.8927 807.0103 852.7879 900.2968 961.0447 1010.8956 1029.0325 1054.0858 1076.3611 1190.9045 1235.9021 1278.6452 1304.1963 1350.8698 1373.1640 1401.6697 1441.3692 1515.3663 1579.5542 3243.7337 3609.3704
redmass: 17.6075 9.9697 7.6682 18.2670 11.1195 11.4511 10.1551 13.6110 17.1694 11.2843 15.2874 10.1586 15.8751 10.7811 7.7487 12.4340 14.1098 7.4047 1.1884 7.8602 11.8651 4.0889 12.7978 1.6337 5.4059 5.8398 13.0316 5.5251 11.8118 9.1846 2.0735 4.2265 4.3946 5.3153 4.0856 5.6284 3.5968 9.5380 5.4454 9.3387 1.0988 1.0831
irintensity: 0.0011 0.1599 0.0646 0.1990 0.1355 0.0285 0.0178 3.5775 2.0414 0.0051 6.6256 2.1809 2.3656 2.8295 1.3062 28.5894 12.9037 3.7298 120.9960 1.0581 1.4136 16.7218 92.4981 21.5109 80.4817 38.6376 241.9699 15.9691 169.0094 212.5465 7.8407 68.8792 119.8024 8.9818 85.0609 102.3327 1.9545 16.9568 131.6916 84.0230 1.5028 129.7060
temp: 298.150 k
press: 1.00000 atm
elementType: 17 9 9 9 7 7 7 7 6 6 6 6 6 6 1 1
symmnumber: 1
zpe: 224295.4 jmol-1
zpe.correction: 0.085430 hartree
zpe.thermalcorrener: 0.096506 hartree
zpe.thermalcorrenthalpy: 0.097450 hartree
zpe.thermalcorrgfe: 0.046597 hartree
zpe.sumelectzpe: -1207.412107 hartree
zpe.sumelectthermal: -1207.401031 hartree
zpe.sumelectthermalent: -1207.400087 hartree
zpe.sumelectthermalfe: -1207.450939 hartree
dipole: 4.1067 -2.1473 -0.0108
dipole: 4.6342
quadrupole: -92.8288 -82.0029 -85.2435
quadrupole: 1.4147 0.0270 0.0015
quadrupole: -6.1371 4.6889 1.4482 1.4147 0.0270 0.0015
hfenergy: -1207.4975364 hartree
pointgroup: C01 [X(C6H2Cl1F3N4)]
dipole: 1.7200352 0.6046496 0.0017726 debye
dipolederiv: -0.1713101 0.2954184 -0.0003482 0.2389095 -0.8269128 0.0009909 0.0000758 0.0006325 -0.0441013 -0.507053 0.2194334 0.0035264 0.1904887 -0.7080758 -0.0089579 0.0012923 -0.0076999 -0.2732291 -0.6502482 -0.0775784 -0.2067849 -0.0926144 -0.3461347 -0.1741776 -0.1909233 -0.1623006 -0.6359567 -0.6480902 -0.0864047 0.2063992 -0.101245 -0.3575615 0.1827948 0.1843791 0.1698041 -0.6186919 -0.4142515 -0.0657646 0.0000774 -0.0054928 -0.5233521 -0.0000619 -0.0002612 0.0015465 -0.1394162 -0.3556456 0.1737516 -0.0002218 -0.194272 -0.4251076 0.0007617 0.0008514 0.0002827 -0.2353506 -0.9173633 0.6120069 -0.0001636 0.1962186 -0.7080909 0.0016528 0.0003175 -0.0010168 -0.0987718 -0.137929 -0.413538 0.0008196 -0.1353985 0.0595363 -0.0003808 0.0002834 0.0001204 -0.1892759 -0.0753791 0.146528 -0.0000695 -0.1341265 -0.7653478 0.0018788 0.0007806 0.00131 0.107665 0.2732371 0.0285913 -0.0004147 0.5189765 0.5740657 -0.0016214 -0.0020192 -0.0010378 0.1336691 0.3042568 -0.124091 0.0007306 -0.0918712 0.6306705 -0.0012717 0.0078587 -0.0007168 -0.0693465 0.8453386 -0.6157441 -0.0002824 -0.2794319 1.6182402 -0.0023502 -0.0017683 -0.0011551 0.0592579 0.2117334 -0.0789784 -0.0002665 -0.0859113 -0.0386162 0.0000883 -0.0003625 0.000064 -0.0691047 1.9854462 -0.0516581 -0.0033801 -0.0898843 1.3932201 0.0005105 -0.0007299 0.0000852 1.5349708 0.0675942 0.0154556 0.0001477 0.0228281 0.0775598 0.0001786 0.0001023 0.0001695 0.1780958 0.1896637 0.022572 0.0002308 0.0428264 0.3459068 -0.0000348 0.0001234 -0.0000879 0.3595862 unknown
polarizability: 132.039529|1.4024916|123.3746088|-0.1145766|-0.1476365|46.6631718 unknown
InChI: InChI=1S/C6H2ClF3N4/c7-3-2-1-11-14-4(2)13-5(12-3)6(8,9)10/h1,14H
charge 0 multiplicity 1
16 atoms
Cl 1.360553 -3.138079 0.005333
F  -2.945658 1.553943 0.024711
F  -3.095737 -0.3801 -1.148013
F  -3.107103 -0.421797 1.122774
N  -0.270396 1.19841 0.000658
N  2.107209 1.849447 -0.005245
N  -0.56262 -1.230956 0.006191
N  3.354636 1.219116 -0.005629
C  1.679705 -0.360149 0.000569
C  1.066603 0.948305 -0.001272
C  -1.01278 0.068201 0.005629
C  0.758093 -1.435372 0.004052
C  3.092586 -0.116018 -0.002484
C  -2.52898 0.21513 0.002267
H  3.915361 -0.826939 -0.002383
H  2.059727 2.867255 -0.007458
