program: Gaussian 09
title: 000243768
version: EM64L-G09RevD.01
frameworkgroup: C1[X(C11H13ClO5)]
method: RPBEPBE
basis: SDD
operation: Freq
keyword: #p
keyword: freq=noraman
keyword: PBEPBE/SDD
title: #p freq=noraman PBEPBE/SDD
converged: YES YES NO NO
title: Mulliken charges:
elementType: Cl O O O O O C C C C C C C C C C C H H H H H H H H H H H H H
charge: -0.059237 -0.263143 -0.332294 -0.273260 -0.449127 -0.205851 0.078466 0.250741 0.091235 0.007283 0.335583 -0.546878 0.190435 -0.658301 -0.528638 -0.513453 -0.530921 0.270415 0.285180 0.296598 0.391029 0.286062 0.219138 0.229760 0.266252 0.217447 0.234080 0.237771 0.226836 0.246788
chargesum: 0.00000
title: Mulliken charges with hydrogens summed into heavy atoms:
elementType: Cl O O O O O C C C C C C C C C C C
charge: -0.059237 -0.263143 -0.332294 -0.273260 -0.058098 -0.205851 0.078466 0.250741 0.091235 0.007283 0.335583 -0.276462 0.190435 -0.076522 0.206323 0.204327 0.180475
polarizability: 2.25952679e+02 7.95453501e+00 1.63819746e+02 -2.89044498e+00 1.31114216e+00 8.35713965e+01
1716.lowfreq: -9.9523 -6.7438 -5.9194 -0.0017 0.0007 0.0019 7.3572 52.1744 59.9851
frequency: -9.7278 52.1663 59.9651 88.3846 91.8326 117.6722 122.3953 146.0254 162.7572 183.7703 190.7303 206.6070 212.6587 218.0758 238.7718 266.1535 272.4937 291.7207 320.5949 334.5234 381.6491 420.6583 442.5429 471.8276 519.3040 546.6085 571.4728 587.3455 632.2550 663.0980 683.1555 697.6115 736.2181 753.3894 797.6252 835.5609 891.9675 909.2238 935.4909 973.1049 1014.5283 1065.4688 1109.2943 1112.2779 1114.7060 1120.8688 1137.7836 1151.3177 1155.9413 1168.8621 1196.5028 1217.6123 1242.9286 1284.0044 1325.4163 1378.1783 1403.4940 1413.0320 1429.3266 1437.8162 1448.2302 1452.6325 1453.9868 1465.7020 1470.6234 1471.7342 1480.8842 1489.5621 1558.3606 1585.1757 1619.0724 2974.9331 2981.0174 2981.8488 3069.7239 3070.0010 3092.8513 3093.1755 3124.5678 3133.1709 3133.7722 3158.4594 3185.1015 3396.0772
redmass: 8.3649 5.6808 3.1600 2.7761 3.7399 4.3708 2.2776 3.9317 1.5769 3.3821 2.0624 4.5796 1.8325 5.4455 2.8520 2.8548 3.5272 2.3628 4.8780 4.7282 5.2626 8.3136 5.1405 6.0679 5.4131 4.9449 7.0729 3.4330 1.1632 5.6141 7.5209 5.4234 4.9262 3.6052 6.6271 1.8937 7.6885 1.9709 9.0932 7.0625 4.5540 7.1715 1.3210 1.2621 1.2812 2.0626 1.1896 1.3960 1.3942 2.0381 1.7372 2.1516 1.6361 1.8800 3.8506 8.1704 2.3045 1.1352 1.2635 1.3941 1.3570 1.0850 1.0803 1.0512 1.0833 1.1033 1.0534 2.6974 8.7055 9.0301 7.1653 1.0320 1.0331 1.0323 1.1045 1.0583 1.0998 1.0993 1.1056 1.1051 1.1012 1.1072 1.0908 1.0631
irintensity: 1.2529 1.4902 0.6412 7.2354 10.3623 0.6963 0.7945 4.8198 2.6476 2.4128 5.3206 3.8786 0.3999 0.5097 3.2784 1.1857 4.1291 3.7548 5.5006 6.9940 2.5543 4.1257 12.7947 4.6246 5.0239 9.1788 38.7952 1.5251 126.5953 6.3109 67.8989 11.9468 4.5672 1.8803 27.5423 37.2131 12.1650 1.4769 0.8534 86.7263 106.6612 115.5061 21.7959 2.7083 21.1750 113.7154 6.4508 6.7681 7.6086 75.5366 85.7341 177.2753 107.7482 44.7954 133.5520 35.3124 40.4224 37.3245 18.3855 8.6652 61.0994 5.7808 15.5284 17.7719 34.4968 50.1330 21.9757 100.9550 179.3274 155.2483 317.5974 56.5339 70.5299 45.2798 35.1918 5.7811 28.1021 29.2301 18.1844 12.7459 20.5680 3.2469 1.1247 108.8801
temp: 298.150 k
press: 1.00000 atm
elementType: 17 8 8 8 8 8 6 6 6 6 6 6 6 6 6 6 6 1 1 1 1 1 1 1 1 1 1 1 1 1
symmnumber: 1
zpe: 588547.3 jmol-1
zpe.correction: 0.224166 hartree
zpe.thermalcorrener: 0.241547 hartree
zpe.thermalcorrenthalpy: 0.242491 hartree
zpe.thermalcorrgfe: 0.179265 hartree
zpe.sumelectzpe: -1261.795251 hartree
zpe.sumelectthermal: -1261.777871 hartree
zpe.sumelectthermalent: -1261.776926 hartree
zpe.sumelectthermalfe: -1261.840153 hartree
dipole: -6.7936 -0.2315 3.0854
dipole: 7.4650
quadrupole: -105.3192 -94.3947 -108.7180
quadrupole: -1.6107 0.1989 2.0552
quadrupole: -2.5086 8.4160 -5.9074 -1.6107 0.1989 2.0552
hfenergy: -1262.0194173 hartree
pointgroup: C01 [X(C11H13Cl1O5)]
dipole: -2.5708218 0.1853705 -1.4079172 debye
polarizability: 222.4356613|-13.1432467|164.5224599|13.1005899|-12.7652706|86.3857006 unknown
InChI: InChI=1S/C11H13ClO5/c1-15-7-4-8(16-2)11(17-3)10(14)9(7)6(13)5-12/h4,14H,5H2,1-3H3
charge 0 multiplicity 1
30 atoms
Cl 4.897975 0.15661 -0.214149
O  0.522531 -2.839249 0.332059
O  -1.836169 2.238639 -0.212114
O  -3.436247 -0.145044 -0.138086
O  0.780676 2.107382 0.031553
O  2.727612 -1.085652 1.524908
C  0.826941 -0.329356 0.2541
C  0.043143 -1.535396 0.251318
C  0.103973 0.883179 0.024585
C  -1.297996 0.929985 -0.12946
C  -2.048675 -0.271482 -0.037627
C  -1.367446 -1.494501 0.119901
C  2.25913 -0.278608 0.671943
C  3.154143 0.806856 0.048325
C  1.883614 -3.212988 -0.088132
C  -2.725652 2.517188 -1.365477
C  -4.241842 -1.362052 0.036411
H  -1.890027 -2.453279 0.116842
H  2.795493 1.145588 -0.9313
H  3.248006 1.670166 0.724109
H  0.078529 2.817423 -0.041054
H  2.58577 -3.104452 0.752894
H  2.224806 -2.586872 -0.934211
H  1.795453 -4.264123 -0.404034
H  -3.631052 1.893866 -1.297625
H  -2.196275 2.323159 -2.317696
H  -2.981881 3.584018 -1.280775
H  -4.040934 -1.829327 1.018074
H  -4.045019 -2.089124 -0.773743
H  -5.285986 -1.021259 -0.011837
