program: Gaussian 09
title: 000243759
version: EM64L-G09RevD.01
frameworkgroup: C1[X(C18H16O6)]
method: RPBEPBE
basis: SDD
operation: Freq
keyword: #pfreq=noraman
keyword: PBEPBE/SDD
title: #p freq=noraman PBEPBE/SDD
converged: YES YES NO NO
title: Mulliken charges:
elementType: O O O O O O C C C C C C C C C C C C C C C C C C H H H H H H H H H H H H H H H H
charge: -0.299877 -0.291877 -0.259313 -0.216366 -0.267628 -0.421195 0.155668 0.230060 0.127466 0.250926 0.012697 0.156647 -0.589466 0.241120 -0.440377 0.351403 -0.354202 -0.339139 -0.397960 -0.346601 0.283584 -0.516773 -0.519447 -0.535435 0.275130 0.244738 0.232239 0.266837 0.226268 0.255307 0.226166 0.212523 0.280172 0.228062 0.262115 0.215474 0.223168 0.226192 0.251801 0.359892
chargesum: 0.00000
title: Mulliken charges with hydrogens summed into heavy atoms:
elementType: O O O O O O C C C C C C C C C C C C C C C C C C
charge: -0.299877 -0.291877 -0.259313 -0.216366 -0.267628 -0.061303 0.155668 0.230060 0.127466 0.250926 0.012697 0.156647 -0.314336 0.241120 -0.195639 0.351403 -0.121963 -0.072301 -0.171692 -0.091294 0.283584 0.202089 0.186205 0.165727
polarizability: 4.00565614e+02 8.98254722e+00 2.61823034e+02 1.05982109e+00 3.28791248e+00 1.02144028e+02
1716.lowfreq: -3.6412 -0.0006 0.0006 0.0007 1.9361 5.9903 21.4579 24.2025 47.5092
frequency: 21.3266 24.1810 47.5007 58.9059 72.4889 81.0192 91.4471 101.7112 123.6057 143.1208 155.0439 161.2199 170.4740 193.4258 201.1909 212.8369 248.2903 258.2831 277.4937 304.0826 313.5694 317.8810 334.4814 352.1538 382.5200 397.0726 408.8565 423.5951 433.9995 471.8444 492.3500 500.9888 531.7169 571.6387 591.2542 619.5803 624.7646 634.8138 640.1374 664.0365 686.7660 727.7660 739.0771 794.9322 803.8805 808.2542 819.8603 845.6474 853.2551 864.4656 871.1822 892.5055 932.6626 944.0122 968.0383 979.6199 997.6261 1009.7313 1057.1258 1092.2677 1103.5656 1107.1050 1109.6731 1111.8399 1145.8575 1151.1510 1154.9038 1158.3490 1174.2494 1185.6487 1193.1841 1250.9480 1253.8456 1267.9920 1294.4162 1301.6895 1328.0208 1374.7678 1384.3188 1392.0878 1414.9126 1428.1858 1433.8428 1436.5159 1451.0381 1457.0670 1461.9864 1468.1687 1472.8718 1481.0249 1488.4119 1504.9314 1534.8662 1554.0320 1586.9570 1599.7244 1624.6856 1629.9885 2965.2487 2975.7695 2979.4604 3056.4984 3081.3543 3092.3511 3121.5950 3124.5197 3126.2380 3132.7681 3158.9724 3164.8102 3184.4442 3185.0008 3186.2903 3578.8927
redmass: 3.6209 4.6490 4.4817 3.5587 5.4403 3.7643 2.5415 2.5184 4.2112 1.5081 1.8858 2.2143 3.8638 3.1540 6.2078 1.6550 5.7625 3.1891 3.5252 6.4982 5.6839 6.8416 5.8706 5.4451 1.1264 4.9625 2.8842 6.4134 5.8586 8.1278 5.7412 3.0062 8.7819 7.2404 6.8507 5.6928 3.9237 7.0562 4.3484 7.0966 4.7483 3.6026 4.8863 3.5176 5.0717 1.3745 3.9684 1.6241 2.4078 1.8603 6.8386 7.4406 8.0565 1.3803 9.3374 1.3534 3.9999 3.1049 6.6366 3.9115 1.2366 1.4008 1.4535 1.2602 1.3185 1.4213 1.3599 1.4839 2.3487 1.1724 2.2252 2.6126 1.9802 4.0455 5.5143 2.2046 1.9261 7.3945 2.6212 4.4946 1.5340 1.3932 3.7231 1.4193 1.1092 1.1644 1.8072 1.0604 1.1361 1.0556 1.0582 2.8522 8.2511 9.3363 6.3675 7.2783 7.4475 6.9545 1.0328 1.0321 1.0306 1.1041 1.1012 1.1033 1.0895 1.1038 1.1039 1.0999 1.0948 1.0886 1.0912 1.0918 1.0960 1.0661
irintensity: 1.6448 1.4084 2.4046 2.5838 1.4369 4.1079 1.0308 4.2615 2.0708 2.3901 1.4700 4.8814 1.0258 2.2000 3.5853 1.1090 6.5932 4.8372 6.2068 1.7386 0.8681 1.9135 5.6744 3.6088 145.0461 13.5507 2.4590 6.2431 7.0916 31.3638 1.4438 20.7991 28.1479 2.4193 4.3381 0.3564 10.3107 2.5782 5.3555 12.7129 5.4927 0.3150 0.4343 8.2248 22.2563 21.3193 34.1642 43.4897 44.3907 18.2885 12.3957 19.7016 35.6881 0.4482 24.9617 0.1020 49.9056 19.0079 55.0303 181.3525 28.9428 73.5103 102.5379 0.1566 328.2619 7.9495 10.9417 34.0053 64.2150 96.1807 28.4771 86.9266 19.4653 26.0637 39.0177 313.3586 136.0600 10.8085 125.9471 143.8163 15.9658 78.1653 59.8741 75.9625 21.2893 3.9621 82.1698 15.1126 11.1343 15.4250 25.2617 66.6623 167.8445 117.4309 5.4681 315.2524 361.8984 74.7076 56.5024 94.7046 90.7535 41.6608 27.8300 17.8736 21.2758 13.8846 23.7717 21.4275 7.0586 4.2435 2.6622 3.2832 5.5556 85.2723
temp: 298.150 k
press: 1.00000 atm
elementType: 8 8 8 8 8 8 6 6 6 6 6 6 6 6 6 6 6 6 6 6 6 6 6 6 1 1 1 1 1 1 1 1 1 1 1 1 1 1 1 1
symmnumber: 1
zpe: 789120.3 jmol-1
zpe.correction: 0.300560 hartree
zpe.thermalcorrener: 0.323235 hartree
zpe.thermalcorrenthalpy: 0.324179 hartree
zpe.thermalcorrgfe: 0.247433 hartree
zpe.sumelectzpe: -1145.071236 hartree
zpe.sumelectthermal: -1145.048561 hartree
zpe.sumelectthermalent: -1145.047617 hartree
zpe.sumelectthermalfe: -1145.124363 hartree
dipole: 3.6591 2.9322 0.2030
dipole: 4.6934
quadrupole: -113.6012 -130.1830 -141.0401
quadrupole: -15.3633 1.5033 -4.0996
quadrupole: 14.6736 -1.9082 -12.7653 -15.3633 1.5033 -4.0996
hfenergy: -1145.3717958 hartree
pointgroup: C01 [X(C18H16O6)]
dipole: 1.4367417 -1.1597631 -0.0193707 debye
polarizability: 400.5185367|-9.3559888|261.8285958|0.7117447|-4.2115969|102.1855436 unknown
InChI: InChI=1S/C18H16O6/c1-21-15-9-14-16(18(23-3)17(15)22-2)12(20)8-13(24-14)10-4-6-11(19)7-5-10/h4-9,19H,1-3H3
charge 0 multiplicity 1
40 atoms
O  0.770633 -0.594476 -0.039436
O  -3.501998 1.965168 -0.012471
O  -4.829754 -0.442212 -0.123572
O  -3.532046 -2.795037 0.005424
O  -0.863466 3.243005 0.070407
O  7.124084 -0.896575 0.090425
C  -1.268863 0.824777 -0.044093
C  -0.632578 -0.449845 -0.046613
C  -2.709511 0.813661 -0.054485
C  1.592408 0.539628 0.032215
C  -3.434086 -0.406139 -0.030678
C  -0.416113 2.043345 0.0364
C  -1.325243 -1.673327 -0.044107
C  -2.733614 -1.656396 -0.019939
C  1.027046 1.793416 0.082366
C  3.025501 0.193561 0.046692
C  4.025023 1.204385 0.080218
C  3.444238 -1.168206 0.027053
C  5.391195 0.872897 0.096079
C  4.806036 -1.510767 0.04169
C  5.783904 -0.489494 0.076934
C  -3.488461 2.855006 -1.197766
C  -5.574252 0.099269 1.03665
C  -2.853025 -4.095199 -0.039598
H  -0.746662 -2.599115 -0.041634
H  1.657028 2.682292 0.152994
H  3.742235 2.261369 0.091827
H  2.686994 -1.955537 0.000294
H  6.146373 1.668743 0.121688
H  5.132021 -2.554566 0.026919
H  -4.303721 3.57194 -1.016944
H  -3.695959 2.267002 -2.111186
H  -2.522212 3.381452 -1.254153
H  -6.636006 0.007555 0.762243
H  -5.305763 1.155295 1.207443
H  -5.365916 -0.507501 1.938514
H  -2.20348 -4.238918 0.845337
H  -2.255204 -4.200923 -0.965006
H  -3.663212 -4.838057 -0.031949
H  7.735828 -0.119076 0.115313
