program: Gaussian 09
title: 000243740
version: EM64L-G09RevD.01
frameworkgroup: C1[X(C15H16N2)]
method: RPBEPBE
basis: SDD
operation: Freq
keyword: #pfreq=noraman
keyword: PBEPBE/SDD
title: #p freq=noraman PBEPBE/SDD
converged: YES YES NO NO
title: Mulliken charges:
elementType: N N C C C C C C C C C C C C C C C H H H H H H H H H H H H H H H H
charge: -0.440257 -0.145326 0.111575 -0.516812 0.427070 -0.658099 0.316644 -0.451246 -0.328881 -0.199584 -0.223630 -0.387350 -0.397353 -0.257609 -0.209987 -0.204453 -0.261971 0.265496 0.205921 0.303720 0.225433 0.213463 0.246816 0.214196 0.321208 0.243064 0.244332 0.223821 0.224240 0.226696 0.221635 0.222309 0.224919
chargesum: 0.00000
title: Mulliken charges with hydrogens summed into heavy atoms:
elementType: N N C C C C C C C C C C C C C C C
charge: -0.136537 -0.145326 0.111575 -0.045396 0.427070 0.027612 0.316644 -0.237050 -0.007673 0.024237 0.000610 -0.144286 -0.153021 -0.030914 0.011648 0.017856 -0.037052
polarizability: 2.85671068e+02 1.02691836e+01 1.54395408e+02 1.36908389e+00 -1.18612558e+01 1.19855872e+02
1716.lowfreq: -6.0300 -5.1639 0.0002 0.0005 0.0006 2.3160 24.7054 36.5106 39.4647
frequency: 24.5885 36.0786 39.4041 51.1423 65.2739 110.5994 139.6849 197.1522 202.3495 249.4818 262.3700 287.2319 350.1195 405.1159 409.1132 436.0263 489.4494 501.5763 511.8654 580.6873 585.9444 612.9456 614.7730 639.7136 679.2619 696.8712 698.1037 735.9333 765.1243 766.5140 783.9819 834.9372 836.5270 840.2474 896.8960 914.1145 921.1168 962.7992 969.3166 980.5385 982.6895 983.4035 1000.3523 1001.3747 1021.5854 1024.9920 1060.0432 1067.8652 1073.6119 1084.9122 1166.7828 1169.0840 1172.3125 1182.5434 1189.6603 1226.9161 1258.6489 1301.6376 1310.9848 1316.4190 1332.7422 1367.2828 1386.2774 1392.9160 1432.1841 1435.3598 1469.5786 1472.7368 1477.9944 1485.6533 1489.3162 1525.3276 1574.1159 1599.3646 1605.2106 1615.0216 1649.3722 2986.2310 2991.1671 3065.4275 3085.9185 3095.1349 3102.5796 3118.9687 3125.2558 3129.0996 3140.2820 3141.2124 3149.1949 3162.8631 3164.2156 3186.5133 3543.5214
redmass: 3.7231 2.7327 4.0660 4.0642 4.4775 4.8158 3.7591 2.8988 1.2787 4.9003 3.1078 3.4872 3.3396 2.9872 2.9522 5.5832 4.0242 3.9108 2.5916 1.2096 4.5715 6.4092 6.3385 5.6411 4.2692 1.9575 1.8586 4.5709 1.7263 1.8557 1.4335 2.5178 1.3459 1.2793 1.4546 1.4256 4.1616 1.3635 1.3445 1.7086 3.5607 4.1086 3.0133 1.3127 2.0891 2.0652 1.9152 1.5116 1.5547 1.5381 1.0673 1.1146 1.2733 1.1699 1.8463 1.8798 1.7401 1.4118 1.3961 1.4706 2.0995 5.4179 2.4613 1.6882 2.3706 2.4463 1.7343 1.1511 1.1920 1.7639 1.2560 2.0607 6.0807 5.0020 5.7217 5.9311 6.5009 1.0358 1.0654 1.0964 1.0992 1.1011 1.0886 1.0845 1.0874 1.0864 1.0932 1.0932 1.0954 1.0996 1.1014 1.0954 1.0759
irintensity: 0.0809 0.0526 0.4258 0.9446 0.8268 0.7445 2.7867 2.0540 0.6320 0.7101 1.8074 0.5817 1.4297 0.0832 0.0151 4.4051 6.1005 12.0306 28.7279 39.0421 4.9188 0.6123 1.8382 1.5025 1.7023 48.9123 38.1622 22.5014 86.6279 56.6830 12.5279 0.8237 0.2326 0.2687 5.4324 10.5219 10.5739 0.0053 0.0823 0.7845 0.2446 1.2333 9.3844 2.8147 11.9396 5.7464 36.2402 7.7503 11.0726 13.5198 3.1057 9.2821 38.3971 5.2686 65.9152 13.7195 24.4308 0.1668 2.0174 25.1602 17.1765 2.8231 47.9450 55.6059 72.6548 3.4850 116.7406 4.4473 29.2539 19.7903 82.7637 458.2158 6.6852 164.8192 91.4661 83.4935 513.2324 31.6459 32.0658 0.7078 42.3419 34.3636 17.4143 8.5005 3.1686 0.1678 24.5321 32.6826 34.2730 30.7609 21.5977 15.6943 20.9979
temp: 298.150 k
press: 1.00000 atm
elementType: 7 7 6 6 6 6 6 6 6 6 6 6 6 6 6 6 6 1 1 1 1 1 1 1 1 1 1 1 1 1 1 1 1
symmnumber: 1
zpe: 712847.7 jmol-1
zpe.correction: 0.271509 hartree
zpe.thermalcorrener: 0.286946 hartree
zpe.thermalcorrenthalpy: 0.287890 hartree
zpe.thermalcorrgfe: 0.226460 hartree
zpe.sumelectzpe: -689.488438 hartree
zpe.sumelectthermal: -689.473002 hartree
zpe.sumelectthermalent: -689.472058 hartree
zpe.sumelectthermalfe: -689.533487 hartree
dipole: 0.5378 3.2499 -0.2979
dipole: 3.3075
quadrupole: -92.9685 -92.4666 -100.2777
quadrupole: 2.5899 -0.1421 -3.6146
quadrupole: 2.2691 2.7710 -5.0401 2.5899 -0.1421 -3.6146
hfenergy: -689.7599475 hartree
pointgroup: C01 [X(C15H16N2)]
dipole: -0.2059169 -1.2369838 -0.3475195 debye
polarizability: 285.4374036|11.8916656|149.1272823|-2.2499381|17.1234038|125.3576618 unknown
InChI: InChI=1S/C15H16N2/c1-2-15(16-13-9-5-3-6-10-13)17-14-11-7-4-8-12-14/h3-12,16H,2H2,1H3
charge 0 multiplicity 1
33 atoms
N  -1.339834 -1.185856 -0.48421
N  0.568294 0.127751 -0.02484
C  0.044791 -1.002128 -0.437986
C  0.837306 -2.258174 -0.819572
C  -2.40483 -0.308651 -0.143569
C  1.110813 -3.156171 0.417136
C  1.960849 0.389971 -0.006608
C  -3.728396 -0.815259 -0.283943
C  -2.212052 1.022022 0.317357
C  -4.839317 -0.008609 0.030401
C  -3.337263 1.816964 0.627553
C  2.694674 0.612174 -1.208202
C  2.629406 0.540887 1.241337
C  -4.652105 1.316941 0.489771
C  4.0626 0.958272 -1.156454
C  3.998423 0.879783 1.282618
C  4.726136 1.088709 0.08625
H  1.79871 -1.948903 -1.262406
H  0.293786 -2.83414 -1.594176
H  -1.63595 -2.108402 -0.80769
H  1.677638 -4.057431 0.122661
H  0.171298 -3.482196 0.899381
H  1.706755 -2.606978 1.166603
H  -3.885332 -1.842884 -0.639395
H  -1.193609 1.399439 0.421461
H  2.175721 0.539641 -2.171271
H  2.057917 0.399282 2.165069
H  -5.850593 -0.415105 -0.083221
H  -3.178319 2.84205 0.981567
H  -5.515327 1.945045 0.734264
H  4.609875 1.131944 -2.090512
H  4.497556 0.987494 2.252786
H  5.786981 1.359118 0.122443
