program: Gaussian 09
title: 000243750
version: EM64L-G09RevD.01
frameworkgroup: C1[X(C19H27FO3)]
method: RPBEPBE
basis: SDD
operation: Freq
keyword: #p
keyword: freq=noraman
keyword: PBEPBE/SDD
title: #p freq=noraman PBEPBE/SDD
converged: YES YES NO NO
title: Mulliken charges:
elementType: F O O O C C C C C C C C C C C C C C C C C C C H H H H H H H H H H H H H H H H H H H H H H H H H H H
charge: -0.233575 -0.455556 -0.454638 -0.237697 -0.149520 0.338700 -0.168952 -0.159101 0.240957 -0.174825 -0.220688 -0.208163 -0.554644 -0.471308 -0.448135 0.537059 -0.635867 -0.838534 -0.500762 -0.794891 -0.571487 -0.590302 0.178662 0.252503 0.259073 0.238829 0.227962 0.249549 0.245746 0.216934 0.232298 0.226734 0.214956 0.228533 0.204914 0.227174 0.233352 0.227842 0.247842 0.266062 0.217038 0.232395 0.212338 0.276058 0.218094 0.243888 0.232920 0.344131 0.253704 0.342399
chargesum: 0.00000
title: Mulliken charges with hydrogens summed into heavy atoms:
elementType: F O O O C C C C C C C C C C C C C C C C C C C
charge: -0.233575 -0.111425 -0.112239 -0.237697 0.102984 0.338700 0.090121 0.079729 0.240957 0.053137 0.028861 0.037583 -0.105412 -0.029618 -0.014688 0.537059 -0.175341 -0.096788 -0.051330 -0.088401 -0.094679 -0.336598 0.178662
polarizability: 2.65765528e+02 -4.69198804e+00 1.90452628e+02 -1.38324144e+01 -2.57023241e+00 1.62426063e+02
1716.lowfreq: -12.9758 -1.9555 -0.0002 0.0003 0.0005 8.7444 33.4338 54.6623 77.4503
frequency: 33.3467 54.6145 77.4295 112.6450 120.9122 132.2448 153.9051 169.7027 182.7008 186.4076 197.4422 216.4790 235.4399 238.7472 252.5676 256.2195 260.4782 269.7173 286.6995 294.0422 309.9846 316.2673 352.3696 363.2141 372.8254 396.1898 412.6923 427.3694 447.9063 470.2487 483.2697 501.0251 527.5150 540.9920 549.9851 580.2636 613.6530 619.5280 645.2863 667.5827 699.3734 742.5563 766.3636 776.1206 793.3001 835.4322 839.3623 858.4112 881.8147 895.4761 906.3078 916.3487 926.1170 943.8898 951.4462 952.4866 979.9982 986.8478 990.6125 1015.5786 1019.4927 1027.7427 1038.7480 1048.9211 1052.0261 1067.3413 1077.2422 1092.3547 1113.2627 1119.4231 1125.5114 1133.9269 1154.5083 1159.6325 1174.0276 1186.8934 1190.1815 1201.8208 1213.9660 1220.6377 1226.7122 1237.2132 1250.6618 1253.9055 1262.9813 1273.5974 1277.7949 1280.6528 1288.6890 1293.5442 1308.2792 1313.4564 1320.9889 1328.0039 1331.8563 1342.5771 1344.2013 1344.3355 1351.9258 1355.9765 1377.5307 1385.1699 1389.7693 1395.3238 1401.6658 1444.8667 1454.1514 1465.5786 1468.6782 1469.2883 1472.0304 1484.2719 1485.5155 1495.6022 1496.7712 1583.7154 1623.0422 2929.5966 2937.6965 2956.4682 2964.1804 2967.1674 2974.9250 2981.2690 2983.8077 2990.9309 2993.8747 2995.0306 2997.0660 3003.7772 3010.6194 3034.7325 3039.7024 3041.3271 3050.7182 3062.9089 3074.2543 3077.1759 3091.9188 3111.8197 3115.8999 3121.2427 3543.5177 3580.7317
redmass: 6.1825 4.5225 4.5749 4.4242 3.3548 3.4777 3.1189 2.5266 4.3033 2.2617 2.0030 3.0071 3.2219 1.9419 1.6766 2.0833 1.3527 2.8532 3.0255 3.1456 1.1830 2.5316 3.0482 3.3339 3.6561 3.2008 3.4191 3.4537 3.6733 4.4487 4.3291 3.9075 2.5257 4.2596 2.6030 3.6815 3.7060 3.9998 3.5085 3.4024 3.0386 3.0541 3.0570 2.4914 2.2355 1.7966 2.0615 2.2920 1.5507 2.0677 2.4005 3.7735 2.0213 2.0860 2.6225 1.9825 2.4701 2.4413 2.9849 2.0746 2.0076 1.9143 2.8354 2.2788 2.1073 2.2340 2.4651 2.1503 1.9142 2.6419 2.0123 1.6254 1.7428 1.8852 1.5993 1.3790 1.7875 1.6374 1.2080 1.4956 1.4652 1.5847 1.3235 1.8645 1.4718 1.5890 1.2962 1.7627 1.3838 1.3992 1.4772 1.5417 1.4034 1.5618 1.2974 1.4554 1.7311 1.4898 1.4423 1.4050 1.4348 1.3089 1.2593 1.3807 1.2867 1.0777 1.0848 1.0648 1.0738 1.0877 1.0717 1.0798 1.0714 1.0665 1.0552 9.9854 7.8054 1.0807 1.0804 1.0664 1.0620 1.0667 1.0810 1.0644 1.0848 1.0694 1.0495 1.0616 1.0835 1.0396 1.0618 1.0950 1.0992 1.0985 1.1025 1.0958 1.1041 1.0979 1.0981 1.1000 1.0911 1.0981 1.0660 1.0664
irintensity: 1.6375 1.8557 0.5404 2.8027 0.2713 0.7578 2.3983 2.9383 4.3447 0.8534 1.6542 3.0809 1.4844 4.8927 42.4317 23.2764 66.2495 1.7154 10.6994 9.9424 143.1409 11.4608 5.5043 1.4578 3.1175 0.9078 3.8147 6.4481 1.1251 7.8444 14.7813 2.9445 0.4107 4.4376 3.3267 5.9313 3.7685 2.3944 1.3437 8.0672 8.8599 2.0816 1.0728 5.9929 1.4292 5.8429 4.3045 1.0251 15.2926 6.7606 17.7558 26.9007 19.3829 15.0601 33.0897 11.0716 2.6039 59.5049 21.2754 35.4200 10.5919 4.3632 6.6296 22.4455 11.0393 31.9455 6.4169 13.7941 13.4966 2.4538 9.5417 6.3809 5.3969 3.8624 5.1980 2.0551 18.2635 22.9944 6.8093 13.0802 18.3979 23.7087 0.1482 6.8113 7.9399 24.1668 5.7312 20.1351 0.3350 1.2273 11.6588 8.6203 1.1724 14.8550 3.8423 7.1700 3.4763 3.6782 0.5577 2.8777 2.6804 2.7464 23.2756 4.4649 22.7126 20.0992 20.6594 8.4686 8.6362 9.9149 1.0870 6.0232 1.8760 11.1056 10.1779 169.2383 191.9262 3.0839 6.8058 12.0161 28.0558 21.5047 37.9621 16.7243 18.6256 7.7109 28.2922 54.1406 39.6427 21.5755 45.1084 48.5896 21.5027 37.7393 6.3686 23.3923 57.3345 36.7310 19.0195 9.0914 11.0292 5.6089 6.2110 5.7119
temp: 298.150 k
press: 1.00000 atm
elementType: 9 8 8 8 6 6 6 6 6 6 6 6 6 6 6 6 6 6 6 6 6 6 6 1 1 1 1 1 1 1 1 1 1 1 1 1 1 1 1 1 1 1 1 1 1 1 1 1 1 1
symmnumber: 1
zpe: 1118018.5 jmol-1
zpe.correction: 0.425831 hartree
zpe.thermalcorrener: 0.447561 hartree
zpe.thermalcorrenthalpy: 0.448505 hartree
zpe.thermalcorrgfe: 0.377829 hartree
zpe.sumelectzpe: -1063.941162 hartree
zpe.sumelectthermal: -1063.919432 hartree
zpe.sumelectthermalent: -1063.918488 hartree
zpe.sumelectthermalfe: -1063.989164 hartree
dipole: -5.9778 0.3609 1.7560
dipole: 6.2408
quadrupole: -168.4880 -126.1922 -143.3185
quadrupole: -5.1683 14.9287 -1.4818
quadrupole: -22.4884 19.8074 2.6811 -5.1683 14.9287 -1.4818
hfenergy: -1064.3669927 hartree
pointgroup: C01 [X(C19H27F1O3)]
dipole: -2.3549239 0.1613609 0.6759991 debye
polarizability: 265.8301849|-5.4494848|190.6736332|-13.179831|-1.8996626|162.1404 unknown
InChI: InChI=1S/C19H27FO3/c1-18-8-7-11(21)9-10(18)3-4-12-13-5-6-14(22)19(13,2)17(20)16(23)15(12)18/h9,12-17,22-23H,3-8H2,1-2H3
charge 0 multiplicity 1
50 atoms
F  -1.828889 -1.349624 -2.030405
O  -0.420679 -2.190463 1.29474
O  -5.084308 -0.879413 -0.338853
O  5.755031 0.027163 -1.140832
C  -1.880767 0.992868 -0.238807
C  -2.700127 -0.303722 0.018716
C  -0.496431 0.986602 0.442153
C  0.314681 -0.243105 -0.082303
C  1.792625 -0.325758 0.489306
C  -1.920673 -1.494334 -0.554519
C  -0.44937 -1.598729 -0.06124
C  -4.012248 0.046617 -0.731771
C  -2.886864 2.13438 0.071167
C  0.26878 2.285162 0.089061
C  -4.278156 1.539162 -0.347123
C  2.484588 1.01355 0.175097
C  1.737889 2.272515 0.575133
C  -3.00954 -0.563883 1.517838
C  2.531883 -1.495994 -0.228441
C  1.852067 -0.519424 2.040407
C  4.068371 -1.427013 -0.113999
C  3.743017 1.088048 -0.367389
C  4.607861 -0.085081 -0.6077
H  -1.686201 1.020524 -1.334632
H  -0.622038 0.923381 1.541417
H  0.44391 -0.050676 -1.17289
H  -2.455129 -2.453018 -0.395063
H  0.060347 -2.290481 -0.763398
H  -3.829013 -0.037859 -1.822779
H  -2.644796 3.056002 -0.48652
H  -2.87144 2.390876 1.147397
H  -0.253099 3.159917 0.521311
H  0.253646 2.41241 -1.013556
H  -4.992684 1.565411 0.495959
H  -4.731194 2.099821 -1.184647
H  1.740248 2.340219 1.683769
H  2.27488 3.165249 0.205514
H  -3.541139 0.296369 1.958695
H  -3.67797 -1.436639 1.615077
H  -2.094067 -0.754427 2.098864
H  2.264617 -1.476814 -1.305325
H  2.171289 -2.45664 0.182985
H  1.277817 0.257992 2.57373
H  1.426295 -1.49476 2.317436
H  2.898308 -0.45762 2.391278
H  4.555382 -2.236578 -0.685924
H  4.384969 -1.550042 0.941903
H  -0.904754 -3.055529 1.274827
H  4.192799 2.063406 -0.596589
H  -5.86672 -0.734818 -0.926476
