program: Gaussian 09
title: 000243761
version: EM64L-G09RevD.01
frameworkgroup: C1[X(C21H30O3)]
method: RPBEPBE
basis: SDD
operation: Freq
keyword: #pfreq=noraman
keyword: PBEPBE/SDD
title: #p freq=noraman PBEPBE/SDD
converged: YES YES NO NO
title: Mulliken charges:
elementType: O O O C C C C C C C C C C C C C C C C C C C C C H H H H H H H H H H H H H H H H H H H H H H H H H H H H H H
charge: -0.432884 -0.217147 -0.235773 -0.101760 0.417818 -0.156758 -0.103499 -0.277125 0.230374 -0.536864 -0.535860 -0.635847 -0.111900 -0.482288 -0.839530 0.540415 -0.641767 -0.493024 -0.809924 0.137884 -0.563643 -0.586673 0.178187 -0.770720 0.201554 0.233171 0.200612 0.241490 0.189561 0.256239 0.220055 0.226521 0.246002 0.233744 0.239739 0.226676 0.215603 0.222652 0.214887 0.265259 0.222843 0.236259 0.218031 0.217325 0.234841 0.219650 0.229720 0.245951 0.231788 0.255338 0.324777 0.232787 0.274059 0.251175
chargesum: 0.00000
title: Mulliken charges with hydrogens summed into heavy atoms:
elementType: O O O C C C C C C C C C C C C C C C C C C C C C
charge: -0.108107 -0.217147 -0.235773 0.099794 0.417818 0.076413 0.097113 -0.035635 0.230374 -0.091065 -0.089284 -0.156102 0.127839 -0.040008 -0.136732 0.540415 -0.182665 -0.057668 -0.125713 0.137884 -0.085904 -0.331335 0.178187 -0.012700
polarizability: 2.99305041e+02 -2.75089172e+00 2.08210006e+02 -1.50943364e+01 -3.61878047e-01 1.72676110e+02
1716.lowfreq: -12.9604 -0.0006 -0.0004 -0.0003 6.1800 14.4756 30.5352 43.8403 50.5982
frequency: 30.4983 43.8141 50.5624 68.0069 83.7930 99.7187 138.8478 142.3869 157.8565 162.1926 175.7725 198.0420 203.9354 228.5013 233.2795 247.1386 258.7523 273.4357 279.0896 287.3608 313.5193 318.0757 325.5287 349.0523 361.9935 371.4253 387.2273 409.6075 424.3532 449.3003 454.9497 480.1883 483.0299 502.4171 526.3182 529.2501 543.9376 557.6893 574.2636 620.5048 643.5994 648.5769 678.2114 733.0176 765.4626 776.7337 799.0270 808.6782 832.5826 846.2359 868.6630 871.6754 888.9985 912.7309 917.8176 928.1606 945.7457 954.1340 966.3225 970.0597 980.4840 1000.5766 1003.8868 1011.3060 1023.4693 1028.4167 1041.2119 1045.7609 1052.6666 1072.1508 1079.4708 1101.8273 1113.3386 1117.2932 1125.4795 1127.4429 1136.8426 1143.9474 1157.1944 1179.5861 1187.1452 1189.2364 1191.5414 1204.7672 1215.1960 1230.5083 1235.4029 1241.6599 1255.8462 1266.9972 1270.8086 1279.2543 1285.2018 1289.9864 1302.1676 1308.5984 1319.9103 1322.1085 1325.7504 1331.8712 1337.1971 1343.3377 1349.4721 1351.8539 1356.1490 1369.4115 1374.3501 1377.0949 1387.0354 1390.2636 1443.5726 1448.7412 1452.4758 1454.5363 1463.6715 1466.9418 1467.9790 1471.4578 1473.1471 1482.7230 1485.3289 1493.5741 1497.8356 1584.7237 1612.7991 1623.7220 2896.0669 2911.1613 2915.3791 2953.3405 2956.8367 2961.2562 2971.1909 2974.6781 2979.4402 2979.6447 2986.0506 2990.6168 2996.0720 2999.7910 3034.2511 3040.2486 3041.8587 3049.1199 3055.1336 3056.0949 3062.1962 3067.4049 3069.1667 3077.7345 3079.2919 3082.1394 3099.0946 3117.7982 3121.7527 3544.1793
redmass: 5.2809 5.1361 3.6235 4.7678 3.9053 4.6276 1.1813 2.1901 2.8487 3.3418 1.8476 2.3948 3.5373 1.9530 1.7957 1.9870 2.2035 3.1433 2.6014 2.1608 1.4380 2.7511 2.1457 3.2494 3.8481 2.6665 2.7686 3.6510 3.1910 3.2545 3.3781 2.9023 2.6193 3.3702 2.8989 2.4012 2.9114 2.6222 3.4708 3.8606 3.6355 2.6284 3.4433 3.0727 2.5988 2.1429 2.5605 2.2616 2.2178 2.3190 2.7101 2.1244 1.5043 1.9876 1.7999 1.7053 1.8968 2.0580 2.2767 2.1658 2.1003 1.9376 1.9814 1.7902 2.5476 1.9856 2.1990 2.2208 2.3344 2.3958 2.0869 1.7622 2.3404 1.8203 1.8592 1.5334 1.6026 1.6047 2.3961 1.3802 1.8513 1.8440 1.6841 2.1493 1.6677 1.4528 1.7371 1.6178 1.5920 2.0203 1.4988 2.0412 1.3894 1.4119 1.3804 1.4946 1.5108 1.4273 1.4113 1.3647 1.5013 2.0795 1.4542 1.4728 1.3688 1.4459 1.2215 1.1835 1.2089 1.2035 1.0781 1.0676 1.0672 1.0873 1.0728 1.0818 1.0885 1.0855 1.0817 1.0555 1.0590 1.0604 1.0606 10.0119 8.3704 7.7079 1.0804 1.0796 1.0808 1.0662 1.0677 1.0719 1.0707 1.0654 1.0395 1.0622 1.0366 1.0406 1.0590 1.0603 1.0973 1.0971 1.0990 1.0970 1.0956 1.0964 1.0955 1.0927 1.0912 1.0988 1.0957 1.0988 1.0984 1.0912 1.1028 1.0661
irintensity: 1.4764 5.0689 2.2256 0.5951 0.8774 1.5573 1.2768 1.6134 5.9055 3.0401 0.6825 2.1174 0.1209 0.9013 0.5341 1.2217 1.0111 0.9576 2.7183 2.4463 58.4276 2.7887 27.1378 29.6199 3.4422 0.5667 1.3258 1.9716 0.9592 2.6819 1.3192 6.6314 0.3939 2.1303 0.2754 0.7964 8.7585 5.4616 8.4732 11.0906 1.3489 2.9899 8.3698 2.4348 0.1128 5.9208 10.8336 4.8855 2.1200 10.0584 6.3736 1.4944 26.2778 1.2910 24.3879 7.1760 5.7031 13.4451 9.0320 10.1641 7.8546 2.3448 9.3792 17.8685 28.9882 5.6857 11.0919 3.6805 13.0362 6.2949 2.2109 8.0366 16.0151 2.0348 4.8056 1.8960 20.8086 4.9731 3.4338 10.4282 25.7475 14.1422 41.4467 2.8913 29.2160 18.3194 1.7255 26.5879 21.7665 41.9233 4.0076 37.6588 5.9685 6.6511 2.1088 9.4990 1.7166 6.7501 5.2743 2.2916 2.7818 6.0384 2.1477 4.8226 6.2167 0.4794 61.0532 50.3305 8.3846 43.1018 18.4978 24.6588 27.6395 19.3247 7.0802 4.2120 6.9852 16.7182 3.3186 7.0398 6.1566 7.8615 6.9922 162.3649 97.0830 202.0357 9.9084 13.5002 18.6063 15.1100 32.7224 9.7318 40.5578 21.7834 2.5215 31.1669 20.6634 10.5651 31.7426 24.2227 45.8030 12.9492 56.7049 38.0575 12.6775 17.8046 22.2065 31.3078 21.3700 50.8383 17.3274 29.3033 20.8584 10.8436 7.3213 6.4292
temp: 298.150 k
press: 1.00000 atm
elementType: 8 8 8 6 6 6 6 6 6 6 6 6 6 6 6 6 6 6 6 6 6 6 6 6 1 1 1 1 1 1 1 1 1 1 1 1 1 1 1 1 1 1 1 1 1 1 1 1 1 1 1 1 1 1
symmnumber: 1
zpe: 1223341.6 jmol-1
zpe.correction: 0.465946 hartree
zpe.thermalcorrener: 0.489189 hartree
zpe.thermalcorrenthalpy: 0.490133 hartree
zpe.thermalcorrgfe: 0.415152 hartree
zpe.sumelectzpe: -1042.050100 hartree
zpe.sumelectthermal: -1042.026857 hartree
zpe.sumelectthermalent: -1042.025913 hartree
zpe.sumelectthermalfe: -1042.100894 hartree
dipole: -3.1742 1.5178 1.5136
dipole: 3.8302
quadrupole: -198.0202 -150.7142 -141.1877
quadrupole: -9.8594 12.7722 1.0579
quadrupole: -34.7128 12.5931 22.1196 -9.8594 12.7722 1.0579
hfenergy: -1042.5160461 hartree
pointgroup: C01 [X(C21H30O3)]
dipole: -1.2421169 -0.6129888 -0.5934498 debye
polarizability: 299.2794556|3.9347066|208.2984746|14.8366527|-0.1385187|172.6132274 unknown
InChI: InChI=1S/C21H30O3/c1-12(22)19-18(24)11-17-15-5-4-13-10-14(23)6-8-20(13,2)16(15)7-9-21(17,19)3/h10,15-19,24H,4-9,11H2,1-3H3
charge 0 multiplicity 1
54 atoms
O  -4.336746 -2.244344 1.063884
O  -4.490979 2.2455 0.077252
O  6.372297 -0.0861 1.176774
C  -1.295612 -0.835421 0.058964
C  -2.101506 0.487892 -0.156197
C  0.130664 -0.791571 -0.524412
C  0.907575 0.39304 0.138834
C  -3.464113 0.067236 0.482922
C  2.403145 0.528583 -0.369272
C  -1.344702 1.622784 0.571827
C  0.117578 1.733279 0.062804
C  -2.273364 -1.943542 -0.399978
C  -3.6869 -1.422209 0.023775
C  0.883571 -2.118539 -0.285759
C  -2.304547 0.837015 -1.657268
C  3.092386 -0.844676 -0.262923
C  2.337321 -2.042683 -0.809701
C  3.142038 1.564657 0.535562
C  2.469031 0.988671 -1.861621
C  -4.658874 1.014017 0.298903
C  4.679276 1.51761 0.420409
C  4.351786 -1.003841 0.259076
C  5.221226 0.113174 0.679123
C  -6.055988 0.422876 0.430426
H  -1.173482 -0.937783 1.164717
H  0.064843 -0.624305 -1.620363
H  0.983751 0.127416 1.21991
H  -3.309583 0.026802 1.588427
H  -1.337585 1.410809 1.6626
H  -1.869022 2.585309 0.433942
H  0.108882 2.10696 -0.978605
H  0.636924 2.502875 0.6630
H  -2.224494 -2.077656 -1.496733
H  -2.07694 -2.931612 0.05343
H  -4.40529 -1.488474 -0.809127
H  0.357376 -2.955061 -0.784159
H  0.893729 -2.341616 0.801452
H  -1.344554 0.971797 -2.183136
H  -2.865453 0.051676 -2.196762
H  -2.872571 1.778541 -1.742781
H  2.300805 -1.965392 -1.91773
H  2.887436 -2.972822 -0.577678
H  2.862216 1.370095 1.591066
H  2.791205 2.584456 0.292522
H  3.514343 1.009566 -2.218141
H  1.906291 0.313629 -2.530014
H  2.053922 2.005324 -1.978728
H  5.159828 2.218545 1.125671
H  5.003809 1.82155 -0.596107
H  4.795308 -2.004993 0.342512
H  -3.710507 -2.343858 1.826296
H  -6.379757 0.032387 -0.555497
H  -6.075173 -0.429481 1.130397
H  -6.767717 1.208107 0.731416
