program: Gaussian 09
title: 000020858
version: EM64L-G09RevD.01
frameworkgroup: C1[X(C7H16O2)]
method: RPBEPBE
basis: SDD
operation: Freq
keyword: #pfreq=noraman
keyword: PBEPBE/SDD
title: #p freq=noraman PBEPBE/SDD
converged: YES YES NO NO
title: Mulliken charges:
elementType: O O C C C C C C C H H H H H H H H H H H H H H H H
charge: -0.275870 -0.267165 0.099461 -0.393197 -0.687511 -0.232344 -0.206785 -0.673191 -0.682858 0.144516 0.230731 0.195530 0.244980 0.214940 0.197955 0.184339 0.190453 0.176704 0.223149 0.201744 0.231991 0.225023 0.201727 0.232656 0.223021
chargesum: 0.00000
title: Mulliken charges with hydrogens summed into heavy atoms:
elementType: O O C C C C C C C
charge: -0.275870 -0.267165 0.243977 0.033064 -0.029636 0.142448 0.193068 -0.014433 -0.025454
polarizability: 9.79642503e+01 -1.20222401e-01 8.93264351e+01 -5.69616002e-01 -2.75783847e-01 7.09321399e+01
1716.lowfreq: -13.6023 -6.8742 -0.0012 -0.0012 -0.0011 6.0737 47.7172 49.6845 57.8978
frequency: 47.6075 49.6403 57.7856 82.0410 101.4611 161.1527 201.9140 225.7201 233.3824 245.9540 253.2722 323.5422 343.9970 467.8826 507.1160 540.7746 752.9412 812.1480 814.3752 843.6984 856.7905 895.8461 945.9943 990.8040 1041.7835 1051.3971 1067.0781 1098.6615 1114.5020 1123.2911 1136.8847 1137.6687 1162.1894 1243.7093 1251.0507 1257.1766 1300.1466 1320.5715 1342.0610 1372.2545 1381.5478 1387.7258 1395.1112 1399.0865 1453.6228 1458.5149 1459.9930 1473.7680 1478.2476 1481.1112 1488.6032 1492.4946 1494.4866 2844.7024 2917.7863 2931.7627 2966.5698 2979.8081 2992.7791 2993.4839 2998.4368 3026.2172 3055.7144 3076.0232 3090.0057 3091.0481 3098.4083 3100.7334 3101.1277
redmass: 2.0686 2.9697 1.7969 2.3044 2.4962 1.7080 2.1886 1.7587 1.3748 1.3223 1.8021 3.1923 3.4983 2.9899 3.3263 3.8894 1.4351 1.0968 1.1015 2.4641 1.9382 2.0270 3.6386 2.3472 3.3200 2.8379 2.9215 1.9778 2.1683 2.2874 1.4605 1.4740 2.2052 1.1632 1.1668 1.2176 1.2136 1.1700 1.4251 1.3954 1.2496 1.2200 1.2827 1.3330 1.0792 1.0411 1.0411 1.0425 1.0489 1.0466 1.0564 1.0795 1.0816 1.0826 1.0560 1.0650 1.1052 1.0372 1.0359 1.0358 1.0621 1.0963 1.0982 1.0992 1.0988 1.0991 1.1004 1.1011 1.1009
irintensity: 0.2338 1.9706 0.4771 0.2798 6.6225 0.7715 1.0988 1.0389 0.9318 1.2470 4.1960 0.8081 8.7454 3.2274 4.6127 1.0924 2.7518 7.4547 6.0795 17.1777 11.0772 8.6384 220.6037 28.2490 128.5661 37.6729 66.1531 8.1211 1.8660 41.4966 4.8762 14.5980 10.7162 2.7655 2.2981 2.6567 10.1540 44.5030 25.5099 5.5033 16.0666 14.6264 11.2298 18.7494 7.3919 10.5628 10.9719 9.3505 5.2606 5.9103 15.7061 5.7382 4.1209 66.5677 65.1477 76.4773 60.7986 40.5969 32.3027 21.1657 26.1831 26.7919 7.7446 55.8976 37.3190 36.3217 37.2179 40.0379 38.9062
temp: 298.150 k
press: 1.00000 atm
elementType: 8 8 6 6 6 6 6 6 6 1 1 1 1 1 1 1 1 1 1 1 1 1 1 1 1
symmnumber: 1
zpe: 579502.1 jmol-1
zpe.correction: 0.220721 hartree
zpe.thermalcorrener: 0.233055 hartree
zpe.thermalcorrenthalpy: 0.233999 hartree
zpe.thermalcorrgfe: 0.181345 hartree
zpe.sumelectzpe: -425.992465 hartree
zpe.sumelectthermal: -425.980131 hartree
zpe.sumelectthermalent: -425.979187 hartree
zpe.sumelectthermalfe: -426.031840 hartree
dipole: -1.0390 -0.1386 2.1525
dipole: 2.3942
quadrupole: -54.7102 -54.1211 -57.8357
quadrupole: -2.1411 -0.7308 -1.1372
quadrupole: 0.8455 1.4345 -2.2800 -2.1411 -0.7308 -1.1372
hfenergy: -426.2131856 hartree
pointgroup: C01 [X(C7H16O2)]
dipole: -0.3960361 -0.1002974 0.8487406 debye
dipolederiv: -1.252631 -0.2849927 0.0780364 -0.4438512 -0.6938988 0.0746203 -0.0053389 0.0103776 -0.4139078 -1.0598846 0.3087088 -0.0371475 0.4489559 -0.843658 0.0463235 -0.004649 0.0261287 -0.3965397 1.4390096 -0.1233098 0.0009749 0.2239157 0.8886312 -0.0358923 0.0662683 0.1188477 0.5310413 0.00509 0.0247062 -0.0296199 -0.0146654 -0.0979709 0.0325039 -0.0610234 0.0612842 0.0634317 -0.000054 -0.0280124 -0.0306648 -0.0764525 -0.0177152 -0.0155405 -0.0152391 0.0157619 0.0766954 0.786311 0.1377277 -0.1100554 0.033732 0.3504755 -0.0894904 -0.2667125 -0.1577477 0.3986663 0.427935 -0.1488161 0.0691806 -0.3407197 0.6193958 -0.0440426 0.1941249 -0.0945304 0.4048512 -0.0478237 -0.0849224 -0.0427055 -0.0908174 -0.0304619 -0.0339127 -0.0223866 -0.0290756 0.0482425 -0.1002268 0.0754898 0.0401313 0.0729981 0.0289541 -0.0120054 0.0291823 -0.0063037 0.0459693 -0.0804302 0.0386231 0.0165659 -0.0408698 -0.0336635 0.0378576 0.0227652 -0.0565045 -0.2631201 0.0865886 -0.0361815 0.0263845 -0.0119758 0.0563783 -0.0468521 0.0049109 -0.0159726 -0.1240891 -0.1809875 0.05123 0.0125461 0.0546754 0.0282719 -0.0056058 0.042492 -0.0183566 0.0786095 -0.1220992 0.0241523 0.0160537 0.0663294 0.1153305 -0.021737 0.0270837 -0.0177081 0.0848221 0.0807721 0.0236156 -0.0247259 -0.005189 -0.1912153 0.0883085 -0.0227255 0.1046879 0.0485544 0.0670493 -0.0093899 0.0479033 -0.0161568 0.0847671 -0.0023117 0.0155115 -0.0648155 -0.1871776 -0.0480124 -0.0175211 -0.1003433 -0.0100056 0.0286272 0.0440237 0.0178585 0.0724039 -0.2212961 -0.0928872 0.0655838 0.033584 0.1374208 -0.1755172 -0.0405228 0.0548871 0.007232 0.0318476 0.0197138 0.030286 0.0498764 0.0702392 -0.0186379 -0.0482798 -0.0136088 0.0437909 -0.2356295 -0.0269116 -0.1189926 -0.021943 -0.0343607 -0.1201083 -0.0044411 -0.0532434 -0.022479 0.0404694 -0.1256214 -0.0595284 0.1063967 -0.0438963 0.0824812 -0.0046205 0.1338466 0.0137519 0.0180515 0.0910709 0.0098671 -0.0459693 0.0131287 0.0692737 0.0696332 -0.0952261 0.0281173 -0.1128481 0.049112 0.1284838 0.00036 0.0699868 -0.1058715 -0.0133075 -0.0257064 -0.0161809 0.0924749 0.036007 0.0755755 -0.0145686 0.107337 -0.1150153 0.0890901 -0.033058 0.1006135 0.0618469 0.0801118 0.0040848 -0.0098301 -0.0168874 0.109949 -0.0103037 0.0432751 -0.0385134 -0.1426387 -0.0312015 -0.0864676 -0.0304204 -0.1528714 -0.0188018 -0.0534952 -0.0332882 -0.0648097 0.0716727 unknown
polarizability: 97.7753362|1.2644571|89.4895198|-0.4958732|-0.8035378|70.9579693 unknown
InChI: InChI=1S/C7H16O2/c1-4-7(8-5-2)9-6-3/h7H,4-6H2,1-3H3
charge 0 multiplicity 1
25 atoms
O  -1.069254 -0.391131 -0.408689
O  1.24119 0.0834 -0.277094
C  -0.059502 0.556177 0.11202
C  -0.245262 1.952616 -0.49261
C  0.723916 2.995686 0.102066
C  -2.273091 -0.497981 0.430765
C  1.619063 -1.207411 0.337154
C  -3.16625 -1.573744 -0.187796
C  3.034501 -1.535146 -0.134565
H  -0.147826 0.577056 1.230381
H  -0.097307 1.859761 -1.583911
H  -1.295684 2.262365 -0.328868
H  1.769138 2.687013 -0.068537
H  0.571212 3.98644 -0.362538
H  0.573812 3.109388 1.193113
H  -1.985079 -0.768776 1.471971
H  -2.806994 0.477006 0.46817
H  1.575304 -1.110079 1.445537
H  0.894102 -1.982319 0.02315
H  -4.091771 -1.696717 0.404143
H  -3.442369 -1.296734 -1.21963
H  -2.637618 -2.542086 -0.221572
H  3.370177 -2.497251 0.294291
H  3.06184 -1.613811 -1.234962
H  3.742749 -0.746522 0.173511
