program: Gaussian 09
title: 000243742
version: EM64L-G09RevD.01
frameworkgroup: C1[X(C20H18)]
method: RPBEPBE
basis: SDD
operation: Freq
keyword: #p
keyword: freq=noraman
keyword: PBEPBE/SDD
title: #p freq=noraman PBEPBE/SDD
converged: YES YES NO NO
title: Mulliken charges:
elementType: C C C C C C C C C C C C C C C C C C C C H H H H H H H H H H H H H H H H H H
charge: -0.485228 0.442912 0.438330 0.446392 -0.418356 -0.379112 -0.412640 -0.420752 -0.387245 -0.386159 0.436600 -0.381334 -0.416823 -0.235351 -0.234175 -0.238797 -0.238863 -0.245276 -0.245516 -0.809354 0.214242 0.233723 0.253510 0.235436 0.235043 0.256032 0.255598 0.226895 0.228016 0.223983 0.223854 0.224039 0.224322 0.226528 0.226630 0.223905 0.224692 0.234300
chargesum: 0.00000
title: Mulliken charges with hydrogens summed into heavy atoms:
elementType: C C C C C C C C C C C C C C C C C C C C
charge: -0.270986 0.442912 0.438330 0.446392 -0.184632 -0.125602 -0.177204 -0.185710 -0.131213 -0.130562 0.436600 -0.154439 -0.188807 -0.011368 -0.010321 -0.014758 -0.014541 -0.018749 -0.018886 -0.126457
polarizability: 2.35956312e+02 2.47898877e-01 2.18023613e+02 -1.75996964e-02 9.81652122e-01 1.67463262e+02
1716.lowfreq: -17.5239 -11.1961 0.0003 0.0005 0.0008 2.7819 7.4407 26.4412 32.5196
frequency: -16.4774 26.0643 32.2640 45.4910 48.5285 59.3734 74.5400 149.9442 199.0504 223.3980 248.7537 258.8206 286.0615 327.3883 358.5919 402.1076 403.4622 407.4237 468.9698 479.6598 502.6454 561.7052 602.6098 614.8272 617.4353 633.4851 650.8214 704.8732 706.3691 716.3375 742.7275 757.5310 786.4852 802.3242 837.5354 853.9127 854.8325 858.4878 859.6225 866.7308 927.2308 931.0272 959.2521 977.7207 978.3810 981.5863 985.2164 990.7106 991.1319 995.0141 996.7237 1014.3227 1026.0699 1027.8634 1046.9700 1080.0274 1083.3111 1124.3562 1165.3163 1171.1815 1171.3950 1188.6010 1190.2574 1194.4537 1201.4997 1204.7211 1223.6260 1264.8133 1265.4873 1313.8144 1327.9671 1335.9544 1368.9852 1382.9440 1385.3563 1396.1042 1407.4161 1436.2214 1440.9081 1470.9805 1473.7709 1480.7053 1481.4211 1506.7351 1582.8470 1590.6707 1593.2191 1609.3900 1612.4184 1624.2833 2970.7347 2973.4783 3053.5309 3083.1369 3108.3252 3113.7287 3114.2605 3118.0145 3122.9351 3123.3150 3132.4162 3135.5105 3135.9079 3145.8092 3146.1755 3147.2408 3161.4341 3161.7940
redmass: 1.0274 3.7306 3.6666 4.0612 3.8881 4.9279 4.4157 3.9880 4.2293 4.2776 5.4379 4.1261 4.5782 4.0057 2.9129 2.8182 2.8295 2.8656 3.5792 3.8421 3.0944 3.9722 4.8401 6.2706 6.1422 6.1854 5.4906 1.8892 1.8496 2.7261 2.1841 2.0932 3.2135 2.0639 2.4520 1.2664 1.2869 1.3517 3.1957 2.5850 1.5015 1.5060 1.3491 1.3856 1.3937 1.3986 1.4162 5.5578 6.1418 1.3099 1.3174 2.9544 2.2998 2.1734 1.5577 1.6162 1.6000 1.3363 3.0621 1.0706 1.0595 1.1181 1.1147 1.1831 2.3360 2.0696 2.8532 1.6375 1.5915 1.3175 1.3552 1.2772 5.3699 5.5610 6.7527 1.2364 2.8149 2.1957 2.1566 1.0580 1.0911 2.2386 2.2503 2.6300 6.0550 6.0477 6.0308 5.9976 6.0537 6.3475 1.0825 1.0383 1.0955 1.0994 1.0868 1.0867 1.0867 1.0882 1.0862 1.0862 1.0964 1.0915 1.0916 1.0956 1.0956 1.0954 1.1014 1.1014
irintensity: 0.4804 0.0438 0.0627 0.2058 0.0807 0.1783 0.3919 0.8130 0.3993 0.9048 0.3606 0.5409 0.5487 1.1957 0.4179 0.2643 0.2209 0.0438 4.7462 3.9694 13.6876 14.2643 16.4285 0.4129 3.3307 2.9160 4.9915 43.5211 44.1076 22.0669 34.5281 38.1428 6.9656 29.1523 12.8831 0.0975 0.0088 0.2121 1.2371 6.7943 2.2713 2.4009 1.5292 0.0729 0.0207 0.0500 1.6186 0.5309 1.0395 0.1090 0.0879 7.6400 6.5836 13.2397 17.7561 2.1335 13.3963 10.5886 0.0111 0.0974 0.0786 2.6380 1.8198 3.0455 0.0413 0.4186 0.7400 1.3492 1.2333 2.0144 0.7259 0.5806 0.5207 0.3263 0.6905 9.7100 1.6229 10.9943 5.2921 13.6108 13.2080 18.5061 25.9935 42.6477 1.9552 1.9663 0.2217 16.4026 5.6990 0.9437 13.4853 43.6029 22.5411 18.4839 13.0733 6.9230 6.6696 19.6209 0.0258 0.0630 30.7125 14.4919 20.5348 28.3170 29.3758 15.7348 40.7815 17.8261
temp: 298.150 k
press: 1.00000 atm
elementType: 6 6 6 6 6 6 6 6 6 6 6 6 6 6 6 6 6 6 6 6 1 1 1 1 1 1 1 1 1 1 1 1 1 1 1 1 1 1
symmnumber: 1
zpe: 820394.9 jmol-1
zpe.correction: 0.312472 hartree
zpe.thermalcorrener: 0.328788 hartree
zpe.thermalcorrenthalpy: 0.329732 hartree
zpe.thermalcorrgfe: 0.266251 hartree
zpe.sumelectzpe: -771.552036 hartree
zpe.sumelectthermal: -771.535720 hartree
zpe.sumelectthermalent: -771.534775 hartree
zpe.sumelectthermalfe: -771.598257 hartree
dipole: -0.5351 0.0395 0.0374
dipole: 0.5379
quadrupole: -108.6315 -111.9155 -110.9260
quadrupole: -0.0219 0.1869 0.3623
quadrupole: 1.8595 -1.4245 -0.4350 -0.0219 0.1869 0.3623
hfenergy: -771.8645077 hartree
pointgroup: C01 [X(C20H18)]
dipole: -0.2040707 0.0486695 0.0277872 debye
polarizability: 235.4260622|-2.4718002|217.7245129|-2.7717902|6.1761297|168.292612 unknown
InChI: InChI=1S/C20H18/c1-16-12-14-19(15-13-16)20(17-8-4-2-5-9-17)18-10-6-3-7-11-18/h2-15,20H,1H3
charge 0 multiplicity 1
38 atoms
C  0.354502 -0.151989 0.747954
C  -1.128932 0.160776 0.482253
C  0.80448 -1.490254 0.132641
C  1.282576 1.014838 0.363618
C  -2.122951 -0.49643 1.25268
C  -1.555007 1.059943 -0.524174
C  1.91162 -2.168976 0.70569
C  1.405298 2.116969 1.249205
C  0.176948 -2.058693 -1.00291
C  1.99798 1.047104 -0.858906
C  -3.925618 0.644244 0.020969
C  -3.494387 -0.260444 1.026989
C  -2.930935 1.294677 -0.750501
C  2.381091 -3.383492 0.161597
C  2.221172 3.222397 0.925374
C  0.645469 -3.2750 -1.552901
C  2.815101 2.153499 -1.188354
C  1.748458 -3.94241 -0.974192
C  2.930456 3.245544 -0.298708
C  -5.402867 0.924382 -0.197138
H  0.450984 -0.271907 1.847359
H  -1.816215 -1.205894 2.031962
H  -0.809529 1.590261 -1.126963
H  2.411619 -1.735754 1.581365
H  0.85203 2.108193 2.196999
H  -0.688228 -1.556004 -1.449031
H  1.927916 0.198197 -1.548057
H  -4.2419 -0.781264 1.638648
H  -3.234759 1.997573 -1.536277
H  3.235134 -3.894226 0.621031
H  2.306578 4.061805 1.624968
H  0.145777 -3.70171 -2.430278
H  3.364111 2.159395 -2.13707
H  2.108042 -4.886733 -1.398405
H  3.567554 4.100473 -0.552031
H  -5.590671 1.35052 -1.198108
H  -6.008717 0.005649 -0.097616
H  -5.785383 1.649442 0.547619
