program: Gaussian 09
title: 000243735
version: EM64L-G09RevD.01
frameworkgroup: C1[X(C10H9ClO2)]
method: RPBEPBE
basis: SDD
operation: Freq
keyword: #p
keyword: freq=noraman
keyword: PBEPBE/SDD
title: #p freq=noraman PBEPBE/SDD
converged: YES YES NO NO
title: Mulliken charges:
elementType: Cl O O C C C C C C C C C C H H H H H H H H H
charge: -0.054126 -0.172683 -0.375753 -0.209516 -0.556876 0.558905 0.027650 0.015375 -0.711353 -0.389080 0.175698 -0.203782 -0.404760 0.254887 0.251629 0.257069 0.226211 0.225815 0.237907 0.256131 0.229413 0.361238
chargesum: 0.00000
title: Mulliken charges with hydrogens summed into heavy atoms:
elementType: Cl O O C C C C C C C C C C
charge: -0.054126 -0.172683 -0.014515 0.045370 -0.048177 0.558905 0.027650 0.015375 -0.021420 -0.389080 0.175698 0.052350 -0.175347
polarizability: 1.58138166e+02 -1.79714989e+00 1.44185044e+02 1.92853506e+00 -5.19632171e+00 6.34149338e+01
1716.lowfreq: -7.2149 -0.0015 0.0001 0.0006 2.7841 8.4085 68.8710 72.2678 110.0620
frequency: 68.8559 72.2591 110.0617 153.5179 169.9940 233.6389 243.6018 295.2613 324.5192 343.8689 363.5270 394.0301 407.8549 456.7232 504.9594 530.5128 576.0961 601.6409 610.8627 650.1080 674.4137 759.8085 800.5831 810.3208 867.9164 913.3533 929.4783 950.8756 991.5366 1053.4703 1065.9222 1093.0275 1113.5498 1150.5766 1179.6868 1196.5033 1237.8104 1242.3222 1269.0986 1289.3932 1297.2480 1387.7123 1397.4215 1408.6115 1434.7917 1459.7121 1473.8206 1483.0011 1587.6778 1601.3879 1642.1212 2984.8029 3002.4385 3016.9460 3075.6926 3082.1008 3095.6675 3125.1701 3170.2883 3559.2222
redmass: 2.7054 7.3101 7.3536 3.7876 6.4604 1.1234 5.4759 3.5624 5.5962 5.9476 4.3198 3.5802 1.2576 3.3414 5.7256 4.3618 3.3836 4.4739 4.5202 4.7496 5.3677 4.2523 1.5548 5.2892 2.9702 1.8459 1.3503 2.7596 3.0221 1.7197 2.5881 1.5960 2.9557 1.3811 1.4038 1.4563 1.7588 2.3755 2.9136 1.4572 1.7066 1.2920 5.9169 3.2189 1.1383 2.7779 1.0838 1.0511 7.9122 8.1899 11.4517 1.0355 1.0691 1.0792 1.0988 1.1006 1.0998 1.0900 1.0949 1.0660
irintensity: 0.8415 6.1359 0.5129 3.7108 4.1535 0.4398 4.5641 5.6262 0.9812 7.0343 3.1854 20.2616 106.8818 8.6812 3.3184 7.3102 1.4123 21.6929 6.1244 11.0815 20.1808 4.0517 48.9542 25.8888 5.8727 6.2214 0.2828 39.4550 35.4582 2.4075 2.8535 17.3660 104.9016 69.5898 5.0079 5.6403 51.1426 118.6594 30.5134 21.7258 17.9028 14.6712 3.5688 63.8531 27.0332 53.6081 2.3008 13.0134 17.0981 131.6398 218.4786 29.4370 7.6505 11.1572 9.3959 33.6448 17.4194 12.1931 3.3188 45.8155
temp: 298.150 k
press: 1.00000 atm
elementType: 17 8 8 6 6 6 6 6 6 6 6 6 6 1 1 1 1 1 1 1 1 1
symmnumber: 1
zpe: 430580.1 jmol-1
zpe.correction: 0.163999 hartree
zpe.thermalcorrener: 0.175728 hartree
zpe.thermalcorrenthalpy: 0.176672 hartree
zpe.thermalcorrgfe: 0.126055 hartree
zpe.sumelectzpe: -996.037217 hartree
zpe.sumelectthermal: -996.025488 hartree
zpe.sumelectthermalent: -996.024544 hartree
zpe.sumelectthermalfe: -996.075161 hartree
dipole: -2.1396 -2.5126 0.1122
dipole: 3.3020
quadrupole: -99.7395 -63.1715 -82.8501
quadrupole: -10.1713 0.1198 -2.1999
quadrupole: -17.8191 18.7488 -0.9297 -10.1713 0.1198 -2.1999
hfenergy: -996.201216 hartree
pointgroup: C01 [X(C10H9Cl1O2)]
dipole: 0.6894868 1.100742 -0.0259918 debye
dipolederiv: -0.8003622 -0.0314852 0.1009729 0.0328829 -0.1324537 -0.0014002 0.1090543 0.0161877 -0.0829115 -1.016579 -0.3378044 0.0581949 -0.2453286 -0.6089923 0.0022461 0.0896564 0.0029965 -0.3159098 -1.3304555 0.4642584 0.1355982 0.2177284 -0.1010849 -0.0079148 0.123963 -0.0422505 -0.3955855 0.05351 0.1120837 -0.0295928 0.0851294 0.0467733 0.0042661 -0.0690928 0.0972293 0.1411386 -0.1961307 0.1660139 0.0552971 0.2210396 -0.2427757 -0.0885198 0.1061757 -0.1343404 0.0418355 -0.0584248 0.1717078 0.0289131 -0.1649987 0.3034593 -0.0159852 -0.0123999 -0.032718 -0.0330538 -0.4266127 -0.2436057 0.0159053 -0.1536146 -0.7982054 -0.0487594 0.0308269 -0.0545311 -0.0301095 1.1560183 0.339494 -0.1374841 0.3474118 1.3660296 0.1033738 -0.1548031 0.1423837 0.1610826 0.0403377 -0.0432402 -0.0437031 -0.0015896 -0.0054865 0.0358878 -0.0028004 -0.0719379 0.0219408 1.1231618 0.0187134 -0.1734727 0.0310235 -0.3565581 -0.0035838 -0.1758826 -0.0282231 -0.0832065 1.3061954 -0.5159906 -0.1698855 -0.0351328 0.2405713 0.0180154 -0.1314879 0.0780861 0.1355449 -0.0215124 -0.1916268 -0.0066791 -0.0580176 0.1683563 0.0122993 -0.0037935 0.0363643 -0.0550089 -0.4272063 0.1298174 0.0191708 -0.2456353 0.0429904 0.0483553 0.0075414 0.0014126 -0.2153094 0.002891 0.0209954 0.075327 0.010464 0.023768 -0.0087012 0.0739557 -0.0236982 -0.062108 0.0623026 0.0063856 0.0110587 -0.0194871 -0.0376154 0.0738539 0.0085401 0.1269454 0.0475171 0.0491041 0.0051039 -0.0304725 -0.0159364 0.0905842 -0.0335663 -0.0504909 -0.0670725 -0.0621959 -0.0003485 0.0026994 0.1298054 0.0296055 0.0859702 -0.0252412 0.0581258 -0.0006452 -0.0614644 0.0739176 0.0650847 -0.012473 0.0997735 -0.1771316 0.0091906 -0.0151274 0.0003085 0.0641918 -0.0606248 -0.0655748 -0.0530302 -0.1240753 0.0702842 -0.034652 -0.0199195 -0.0140538 0.0771874 0.054057 -0.0733393 0.0086258 -0.0656877 0.0094417 0.0008323 0.0104081 0.0015138 0.1550354 0.0033809 0.1019085 0.0272617 0.0681781 -0.0651922 -0.0245373 0.0256513 -0.0283471 0.1715843 0.4133805 -0.1015991 -0.0093379 -0.0137331 0.0772672 -0.0154595 -0.0081004 -0.00561 0.3798047 unknown
polarizability: 157.655598|0.3919571|144.1524838|-8.5838643|2.8644478|63.9300623 unknown
InChI: InChI=1S/C10H9ClO2/c1-5-4-8(13)10-7(12)3-2-6(11)9(5)10/h2-3,5,12H,4H2,1H3
charge 0 multiplicity 1
22 atoms
Cl 3.315531 0.813617 -0.469507
O  -2.587213 -1.618511 0.091913
O  -2.658437 1.38334 0.319713
C  1.090594 -1.641145 -0.270065
C  -0.272977 -2.371117 -0.434172
C  0.69391 -0.168535 -0.176329
C  -0.70994 -0.009642 -0.009806
C  -1.372606 -1.346213 -0.078339
C  1.853614 -2.10609 1.00055
C  1.511438 0.9715 -0.205189
C  -1.279943 1.28098 0.154165
C  0.961886 2.261201 -0.053996
C  -0.429453 2.416293 0.131335
H  1.748345 -1.799916 -1.145082
H  -0.368658 -3.268423 0.200907
H  -0.44046 -2.694886 -1.479408
H  1.221141 -1.98764 1.899348
H  2.127346 -3.172551 0.909231
H  2.779468 -1.524404 1.148357
H  1.612504 3.140098 -0.081805
H  -0.846643 3.42426 0.249314
H  -2.936745 2.330483 0.405465
