program: Gaussian 09
title: 000243736
version: EM64L-G09RevD.01
frameworkgroup: C1[X(C11H9NO3)]
method: RPBEPBE
basis: SDD
operation: Freq
keyword: #p
keyword: freq=noraman
keyword: PBEPBE/SDD
title: #p freq=noraman PBEPBE/SDD
converged: NO YES NO NO
title: Mulliken charges:
elementType: O O O N C C C C C C C C C C C H H H H H H H H H
charge: -0.258017 -0.406269 -0.227312 -0.421175 0.239432 0.277410 0.192677 0.150551 -0.022726 -0.350105 -0.382635 -0.813837 -0.272894 -0.215933 0.050468 0.333984 0.261486 0.234037 0.280972 0.231951 0.264717 0.234117 0.234456 0.384646
chargesum: 0.00000
title: Mulliken charges with hydrogens summed into heavy atoms:
elementType: O O O N C C C C C C C C C C C
charge: -0.258017 -0.021623 -0.227312 -0.087191 0.239432 0.277410 0.192677 0.150551 -0.022726 -0.088619 -0.148598 -0.036198 -0.038778 0.018523 0.050468
polarizability: 1.97938066e+02 1.98678337e+01 1.60221740e+02 1.35451708e-01 1.19153321e+00 6.42094435e+01
1716.lowfreq: -79.9718 -3.1075 0.0003 0.0007 0.0008 4.1697 7.7414 59.9917 75.7898
frequency: -79.9551 59.9693 75.7867 99.5560 128.0200 184.3102 240.3621 273.2112 300.8730 346.6994 347.8985 372.2345 425.8257 444.9519 455.3255 505.0756 545.7091 591.8611 618.9870 638.3694 655.8292 680.1113 689.9850 725.2133 747.5610 775.7306 780.6651 831.1229 864.0987 878.3835 940.1476 948.5003 984.7924 1031.9876 1042.4926 1047.5526 1078.6848 1124.3337 1171.1554 1181.4136 1249.5557 1257.5280 1279.5202 1290.2536 1367.9724 1390.3184 1398.7262 1410.9842 1461.5326 1466.8599 1479.4077 1494.4524 1546.8125 1593.2196 1611.2375 1623.4621 1635.5371 2992.7930 3080.8835 3116.9842 3126.5508 3146.1121 3163.6723 3181.6773 3498.4635 3510.4922
redmass: 1.1276 6.8046 4.5210 4.6501 5.6285 5.9941 4.7964 4.9038 4.4953 5.8892 3.9074 5.5903 5.7526 4.6001 4.5856 3.2766 3.1955 4.3006 1.8669 3.0540 5.8104 5.2746 1.8667 4.7056 2.0998 1.7440 2.8506 4.2197 1.5687 4.2271 6.4622 1.4194 1.3291 2.4086 1.5418 2.1305 2.1559 2.1275 1.7846 1.2337 2.5562 2.4158 2.4486 1.9427 3.4610 1.7990 1.5520 3.8375 3.1915 1.1142 1.0797 2.6507 7.6091 6.4860 6.1032 5.4072 8.9132 1.0400 1.0927 1.1000 1.0881 1.0898 1.0953 1.0974 1.0638 1.0764
irintensity: 0.5697 3.4783 0.2252 3.0215 0.2273 2.2205 5.8455 0.0905 0.4639 3.0914 9.8973 0.8372 9.6077 5.8152 5.9819 6.3292 14.0708 52.7290 73.4679 48.8388 17.9241 1.9013 4.9895 11.1200 0.3767 157.5488 17.4821 2.1171 6.2522 16.8586 40.9240 3.5939 0.7507 57.4377 7.6216 52.6275 140.7356 15.0384 53.4253 2.9296 1.2579 14.7445 23.0682 27.4784 17.5781 33.2597 38.4215 11.7222 10.2589 11.0042 19.2925 22.9699 24.7763 18.1129 267.2916 256.4556 131.2869 13.9212 8.4628 2.1317 4.7960 9.8932 16.6303 10.9202 36.4580 34.3627
temp: 298.150 k
press: 1.00000 atm
elementType: 8 8 8 7 6 6 6 6 6 6 6 6 6 6 6 1 1 1 1 1 1 1 1 1
symmnumber: 1
zpe: 467798.5 jmol-1
zpe.correction: 0.178175 hartree
zpe.thermalcorrener: 0.190085 hartree
zpe.thermalcorrenthalpy: 0.191029 hartree
zpe.thermalcorrgfe: 0.139870 hartree
zpe.sumelectzpe: -703.976159 hartree
zpe.sumelectthermal: -703.964249 hartree
zpe.sumelectthermalent: -703.963304 hartree
zpe.sumelectthermalfe: -704.014464 hartree
dipole: -2.2822 -1.7147 1.0392
dipole: 3.0378
quadrupole: -72.5043 -89.3841 -91.7866
quadrupole: -14.3163 0.1227 -4.8209
quadrupole: 12.0540 -4.8258 -7.2283 -14.3163 0.1227 -4.8209
hfenergy: -704.1543339 hartree
pointgroup: C01 [X(C11H9N1O3)]
dipole: 0.9346322 0.6657635 0.3341761 debye
dipolederiv: -0.8169774 -0.287285 0.0155317 -0.6709163 -1.1594726 0.044191 0.0349323 0.0229761 -0.3697472 -0.731116 0.178597 0.3790193 0.2003927 -0.3975809 -0.2423745 0.4215845 -0.2858174 -0.7631496 -0.4830996 0.1330012 0.1408268 -0.0064115 -0.8232287 0.3219005 0.197358 0.0985904 -0.6362619 -0.8392603 -0.4794675 0.0258487 -0.043288 -0.4095939 0.0049597 0.0146633 0.0200425 -0.2781695 -0.2079023 -0.1236058 0.0076938 0.0058042 -0.2301251 0.0016685 -0.012744 0.0628439 -0.0099779 0.2637756 0.3851824 -0.0151528 0.181025 0.3854216 -0.0125965 0.0092029 -0.0251569 0.1103034 0.298032 0.2006743 0.0250432 0.0472216 -0.1729892 0.0082472 0.0025395 -0.0141154 -0.0541891 0.3793328 0.1980604 0.0091774 -0.4247084 -0.428334 0.0354461 0.0483852 -0.0362073 -0.0086017 0.9999756 0.3787356 -0.027979 0.7777053 1.3040395 -0.0567492 -0.0434022 -0.025526 0.191444 0.2160531 0.0112506 -0.0036189 0.1350549 0.1218913 -0.0030596 0.0087766 -0.0361649 -0.1046961 -0.062197 -0.2198095 0.0064772 -0.0486821 -0.0042804 -0.0082151 -0.0071767 -0.0038203 -0.1983035 -0.2835463 -0.0227357 0.0078189 0.1889274 -0.006016 -0.0047917 -0.0387165 -0.0097102 0.0251108 -0.2891403 0.0648817 -0.0028915 0.2617797 0.0296952 -0.0174784 -0.0245161 -0.0182312 -0.1780462 0.0647166 -0.0045586 -0.0043835 -0.2452908 0.0661968 -0.0041747 0.0065644 -0.0075337 -0.129322 0.8012777 -0.4506678 -0.5860912 -0.3040356 1.2622808 -0.1899282 -0.6231101 0.0499486 1.0380603 0.1193392 0.0046159 0.0047194 -0.0096899 0.1846118 0.0049267 0.0041514 0.0048153 0.3117085 0.118494 0.0566391 -0.003866 0.0292687 -0.0051166 0.0003117 0.0123889 0.009849 0.1413676 0.0645115 0.017467 0.0018998 0.0776501 -0.0926927 0.0080989 -0.001356 0.0107085 0.1700621 0.1318749 -0.013692 0.0005737 -0.1492391 0.0027749 0.0257634 0.0135579 0.0165493 0.1202113 0.001342 0.000766 -0.03239 0.0133586 0.0858498 0.0835914 -0.0837055 0.0621079 -0.0515502 0.0381596 0.020497 0.020705 0.0295358 0.0770366 -0.0928172 0.0676024 -0.0587281 0.0285389 -0.0050994 -0.0909991 0.0062606 -0.1063674 -0.0330417 0.0106936 0.0102216 0.0132452 0.1652627 -0.118268 0.0270848 0.0051034 0.0310844 0.0911652 0.0016498 0.0070278 0.0021146 0.1575178 0.339722 0.0153683 0.0196742 0.0298207 0.1515084 0.0807366 -0.0242295 0.1472203 0.3224277 unknown
polarizability: 198.4043046|18.5954325|159.0455146|-8.3031966|-5.5647012|64.9194302 unknown
InChI: InChI=1S/C11H9NO3/c1-6-9(11(14)15)7-4-2-3-5-8(7)12-10(6)13/h2-5,12,14H,1H3
charge 0 multiplicity 1
24 atoms
O  -1.702431 -3.040643 0.177921
O  -2.25155 2.150334 0.98166
O  -1.010533 2.7751 -0.868301
N  0.388671 -2.037866 0.087565
C  0.706681 0.370755 -0.016914
C  1.260988 -0.950225 0.021872
C  -0.751723 0.5039 0.037289
C  -1.595495 -0.602301 0.098273
C  -1.015089 -1.971351 0.121635
C  1.612503 1.470744 -0.084662
C  2.665476 -1.156822 -0.000864
C  -3.106337 -0.553851 0.108002
C  3.001226 1.265403 -0.104417
C  3.530413 -0.05278 -0.062737
C  -1.320832 1.893642 -0.032805
H  0.772899 -2.987959 0.111292
H  1.216576 2.487713 -0.142432
H  3.06438 -2.177764 0.030533
H  -3.497797 -1.57295 0.252161
H  -3.500499 -0.167984 -0.850907
H  -3.481763 0.10223 0.909866
H  3.677669 2.124144 -0.158753
H  4.614013 -0.210586 -0.080174
H  -2.590245 3.082118 0.876798
