program: Gaussian 09
title: 000243727
version: EM64L-G09RevD.01
frameworkgroup: C1[X(C4H5ClO2)]
method: RPBEPBE
basis: SDD
operation: Freq
keyword: #p
keyword: freq=noraman
keyword: PBEPBE/SDD
title: #p freq=noraman PBEPBE/SDD
converged: NO YES NO YES
title: Mulliken charges:
elementType: Cl O O C C C C H H H H H
charge: -0.017890 -0.440431 -0.235185 0.392663 -0.743181 0.139627 -0.527735 0.251443 0.251439 0.235758 0.306770 0.386721
chargesum: 0.00000
title: Mulliken charges with hydrogens summed into heavy atoms:
elementType: Cl O O C C C C
charge: -0.017890 -0.053709 -0.235185 0.392663 -0.004541 0.139627 -0.220965
polarizability: 9.42066630e+01 -6.49003044e+00 5.92357994e+01 -2.30517694e-03 2.77340643e-03 2.87926010e+01
1716.lowfreq: -6.3196 0.0023 0.0028 0.0036 0.7036 11.8482 61.7542 81.3630 177.5854
frequency: 61.7158 81.3354 177.5821 180.0364 260.4515 347.4503 407.7988 464.4737 574.2527 579.6592 699.7442 746.1677 797.0705 855.4744 982.0006 1046.9203 1047.6680 1148.6792 1284.3655 1336.1975 1403.9417 1457.0906 1460.6500 1623.2595 1643.5275 2999.0516 3078.7139 3122.6190 3216.6535 3535.7809
redmass: 2.3348 1.4540 5.0253 7.3700 4.0883 7.4115 2.5853 6.0833 1.1632 4.2818 4.5543 4.9204 5.2954 1.4693 2.4814 2.0094 1.4638 1.5474 1.3922 3.0729 1.2635 1.0751 1.0438 8.5540 7.1632 1.0372 1.0972 1.0999 1.0952 1.0644
irintensity: 0.9960 0.0000 0.2714 1.7368 3.9908 1.9888 24.4745 27.6223 122.5834 37.1834 62.1447 35.2737 33.1563 29.8709 87.8199 228.9059 0.6737 34.9636 0.5673 97.8510 24.2739 3.2579 16.4098 74.4146 341.9394 7.3322 11.3374 5.8887 3.1366 45.2546
temp: 298.150 k
press: 1.00000 atm
elementType: 17 8 8 6 6 6 6 1 1 1 1 1
symmnumber: 1
zpe: 219038.2 jmol-1
zpe.correction: 0.083427 hartree
zpe.thermalcorrener: 0.091285 hartree
zpe.thermalcorrenthalpy: 0.092230 hartree
zpe.thermalcorrgfe: 0.050101 hartree
zpe.sumelectzpe: -765.384933 hartree
zpe.sumelectthermal: -765.377075 hartree
zpe.sumelectthermalent: -765.376131 hartree
zpe.sumelectthermalfe: -765.418259 hartree
dipole: -0.0712 -0.9669 0.0000
dipole: 0.9696
quadrupole: -51.4771 -44.4475 -48.2032
quadrupole: 6.9646 0.0008 0.0002
quadrupole: -3.4345 3.5951 -0.1606 6.9646 0.0008 0.0002
hfenergy: -765.4683604 hartree
pointgroup: C01 [X(C4H5Cl1O2)]
dipole: -0.0311067 -0.3801867 -0.000005 debye
dipolederiv: -0.9270823 0.059581 0.0000338 -0.1801998 -0.0977774 0.0000054 0.0000147 -0.0000044 -0.0508554 -0.4073606 -0.2442359 -0.0000256 -0.424726 -1.1924452 -0.0000556 -0.0000682 -0.0001244 -0.4330026 -1.0414957 0.3246728 0.000077 0.1386713 -0.7410508 -0.000069 -0.0000133 -0.0000168 -0.3231314 -0.9457158 0.0558618 0.0000281 0.0311358 0.2119734 0.0000129 0.0000509 0.0000231 -0.0204804 -0.0273977 0.0343469 0.0000019 0.0046671 -0.1709227 -0.0000188 0.0000229 -0.0000303 0.0648309 1.7384096 -0.1478999 -0.0000706 0.341222 1.4203788 0.0001343 0.0000193 0.0001558 0.2261682 1.3428026 -0.0398527 -0.0000569 -0.0408779 -0.0050802 0.0000107 -0.0000449 0.0000065 -0.179039 0.0976622 0.0262221 -0.0902505 0.0274825 0.0498948 0.043559 -0.0649976 0.0714644 -0.0188685 0.0977029 0.0261841 0.0902278 0.0274732 0.049898 -0.0435545 0.0649724 -0.071463 -0.0189343 -0.0675206 -0.0936192 0.0000216 0.0035735 0.0847532 -0.0000035 0.0000214 0.0000085 0.1180608 0.005049 -0.0152272 0.0000072 -0.0302095 0.0521102 -0.000008 0.0000109 -0.0000056 0.2285904 0.1349464 0.013966 0.0000062 0.101788 0.3382679 -0.000013 0.0000114 -0.0000138 0.4066612 unknown
polarizability: 94.0987377|-6.7737056|59.3437247|-0.0022825|0.0027921|28.792601 unknown
InChI: InChI=1S/C4H5ClO2/c1-3(2-5)4(6)7/h2,6H,1H3
charge 0 multiplicity 1
12 atoms
Cl 2.955868 -0.302911 0.000011
O  -1.361496 -1.558451 0.000004
O  -2.189325 0.613485 0.000224
C  0.222529 0.283377 0.000159
C  0.442608 1.776456 0.000243
C  -1.201972 -0.160628 0.000219
C  1.188698 -0.674819 0.000053
H  -0.033748 2.234767 -0.884639
H  -0.033509 2.23463 0.885328
H  1.515261 2.023524 0.000122
H  0.986771 -1.746586 0.000005
H  -2.333282 -1.769046 -0.000026
