program: Gaussian 09
title: 000243734
version: EM64L-G09RevD.01
frameworkgroup: C1[X(C10H8Cl4O2)]
method: RPBEPBE
basis: SDD
operation: Freq
keyword: #p
keyword: freq=noraman
keyword: PBEPBE/SDD
title: #p freq=noraman PBEPBE/SDD
converged: NO YES NO NO
title: Mulliken charges:
elementType: Cl Cl Cl Cl O O C C C C C C C C C C H H H H H H H H
charge: -0.018823 0.004152 0.004076 -0.019447 -0.302164 -0.132278 -0.208221 -0.641950 -0.641823 0.307222 0.634274 -0.232205 -0.232270 -0.229080 -0.229043 -0.092214 0.240436 0.247349 0.239316 0.247212 0.240300 0.239382 0.287910 0.287889
chargesum: 0.00000
title: Mulliken charges with hydrogens summed into heavy atoms:
elementType: Cl Cl Cl Cl O O C C C C C C C C C C
charge: -0.018823 0.004152 0.004076 -0.019447 -0.302164 -0.132278 -0.208221 0.085151 0.085070 0.307222 0.634274 -0.232205 -0.232270 0.058830 0.058846 -0.092214
polarizability: 2.09550786e+02 2.57519370e-02 1.53485698e+02 5.45045359e+00 -3.64266054e-02 9.46439349e+01
1716.lowfreq: -3.6029 -0.0011 0.0022 0.0025 5.8368 9.0573 20.3603 34.0796 37.5540
frequency: 20.1008 33.7337 37.5458 45.3863 97.4461 141.5202 148.9368 173.7373 196.8351 200.6073 203.4070 228.8137 238.5833 268.6813 289.9952 327.6342 328.3906 338.5951 349.8842 365.6783 408.1963 412.6916 506.2847 534.7906 546.6618 561.6228 624.6725 669.9989 697.9351 738.3332 759.4701 782.4192 837.9589 855.8520 863.5893 915.7191 946.9180 990.4201 1014.9889 1044.4149 1106.6390 1139.7776 1176.3504 1186.3689 1212.0737 1226.3467 1355.8611 1372.1725 1382.5183 1399.8712 1425.8173 1450.7121 1461.7672 1468.6801 1482.5543 1564.4061 1575.5307 1701.8259 3002.0953 3003.8295 3104.9439 3109.3023 3113.9640 3117.2748 3189.4067 3190.7752
redmass: 7.9051 5.9904 19.6142 9.2776 16.5845 9.5459 8.7994 19.3104 4.6392 2.5651 10.6701 10.2648 1.2089 1.0348 5.6003 4.6337 2.8296 7.1061 28.6656 5.1469 7.9922 12.9737 5.0515 5.3996 7.3213 4.3180 4.7300 6.0166 7.5589 5.9425 11.2972 10.8952 5.9920 1.4325 1.3624 3.0448 1.4618 4.0803 1.2864 3.6943 2.6382 1.8799 4.0992 1.4710 3.3267 2.9637 5.8528 4.9535 1.1798 1.1863 3.3727 1.0467 1.0471 1.0550 1.0531 9.6286 8.5624 12.9016 1.0344 1.0347 1.1006 1.1001 1.1017 1.1012 1.0933 1.0941
irintensity: 0.8904 0.4148 0.4212 0.3928 0.5746 0.6288 1.0723 0.4559 0.0073 0.3694 0.6480 3.6615 0.0013 0.1795 0.0377 3.4126 1.6807 0.4970 0.0767 1.3512 5.2091 15.1215 0.0048 13.2206 4.8087 0.0377 21.5695 2.6480 0.9659 64.1354 73.5541 57.0632 7.0442 44.6563 0.0023 9.7401 0.8618 561.6709 0.0666 4.9484 14.7563 30.6552 6.6544 3.3867 70.9843 13.7998 14.1366 24.2100 16.9670 20.9197 178.2552 7.2916 2.1869 10.9247 32.7167 67.9095 57.5177 131.6319 6.8670 8.3818 2.9310 21.9678 5.7184 23.7472 3.4160 1.2032
temp: 298.150 k
press: 1.00000 atm
elementType: 17 17 17 17 8 8 6 6 6 6 6 6 6 6 6 6 1 1 1 1 1 1 1 1
symmnumber: 1
zpe: 408341.2 jmol-1
zpe.correction: 0.155529 hartree
zpe.thermalcorrener: 0.172557 hartree
zpe.thermalcorrenthalpy: 0.173501 hartree
zpe.thermalcorrgfe: 0.108067 hartree
zpe.sumelectzpe: -2375.367695 hartree
zpe.sumelectthermal: -2375.350667 hartree
zpe.sumelectthermalent: -2375.349723 hartree
zpe.sumelectthermalfe: -2375.415157 hartree
dipole: 0.9268 0.0201 -3.1472
dipole: 3.2809
quadrupole: -120.0151 -115.3142 -126.1087
quadrupole: -0.0748 9.6164 0.0223
quadrupole: 0.4642 5.1651 -5.6294 -0.0748 9.6164 0.0223
hfenergy: -2375.523224 hartree
pointgroup: C01 [X(C10H8Cl4O2)]
dipole: -0.3210613 -0.0168922 1.2501367 debye
dipolederiv: -0.3903299 -0.0026198 0.218941 -0.0024184 -0.1961096 0.0026743 0.2304548 0.0027949 -0.4389684 -0.2562281 0.255574 -0.0337546 0.2605459 -0.5498935 0.0394315 -0.0250136 0.0330448 -0.0251885 -0.256758 -0.2543315 -0.0434536 -0.2597365 -0.546132 -0.0594832 -0.0350761 -0.0531549 -0.0288182 -0.8498119 0.0019275 -0.0885279 0.0023727 -0.1204528 -0.0012345 -0.1143658 -0.0012405 -0.0557925 -1.9412456 -0.0066113 0.3966698 -0.0062595 -0.2051701 0.0065664 0.3928498 0.0070174 -0.5815772 -0.5879898 0.0039164 -0.2164614 -0.0051259 -0.1914431 0.0111997 0.2809788 0.0110953 -0.8127489 0.3591591 0.003224 -0.3118138 0.0044059 0.2507316 -0.0029942 -0.5078765 -0.0024363 0.5074998 -0.1080704 -0.0136659 0.0375487 0.042223 -0.0609922 -0.0144583 0.0523728 -0.0504775 -0.0586317 -0.1073175 0.0127341 0.0382779 -0.042067 -0.0628451 0.0147569 0.0520557 0.0501245 -0.0573614 1.7968059 0.0027318 -0.1217474 0.0141118 0.107854 -0.0200282 -0.7377906 -0.0204567 1.228413 1.0177394 0.0017001 -0.1237028 -0.0043485 -0.296049 -0.0060883 0.2111442 -0.0063035 0.0226694 0.3158186 -0.3500963 0.1003478 -0.3347654 0.8633769 -0.0593672 0.0329207 -0.0279068 -0.0254175 0.3163268 0.3463002 0.1136932 0.3337816 0.8583879 0.0932408 0.0461239 0.0620575 -0.0207419 -0.4794096 0.1460958 -0.0403612 0.1338703 -0.2331471 0.0295214 -0.0499923 0.0224422 -0.0659008 -0.4795728 -0.1441669 -0.0459941 -0.1318558 -0.2308614 -0.0357474 -0.0551625 -0.02869 -0.0682203 1.2965834 -0.0034792 0.1646203 -0.004093 0.2775926 0.0060349 0.1984654 0.0060384 -0.0353218 -0.1046452 -0.0125804 -0.0853539 0.0123615 0.088318 -0.0108126 -0.0870922 -0.0174139 0.0774344 0.1331892 0.0413336 -0.0282371 0.0317462 -0.0440357 0.0559968 -0.0196666 0.0865534 0.0337348 0.067961 -0.0011811 0.0989141 0.0104818 0.0681071 -0.0168551 0.1357821 -0.0096804 -0.0241801 0.1329907 -0.0413704 -0.0296136 -0.0319564 -0.0404685 -0.0576487 -0.0208854 -0.0882957 0.0303841 -0.1052068 0.0152658 -0.0847538 -0.0099266 0.0876287 0.0112952 -0.0869499 0.0178598 0.0784162 0.0683857 -0.0009985 0.0986895 -0.0139142 0.067612 0.0186038 0.1353525 0.01164 -0.0239121 0.0808003 -0.0250322 -0.0074499 -0.0259235 0.0541677 -0.0058389 -0.0148428 -0.0063218 0.171965 0.0808254 0.0253301 -0.0064771 0.02649 0.0538238 0.0012348 -0.0137863 0.0017097 0.1722645 unknown
polarizability: 209.7912983|-0.0940549|153.4606441|1.4145551|1.2185346|94.428476 unknown
InChI: InChI=1S/C10H8Cl4O2/c1-10(2,14)9(15)16-8-6(12)3-5(11)4-7(8)13/h3-4H,1-2H3
charge 0 multiplicity 1
24 atoms
Cl 4.332353 0.01012 -1.422103
Cl -0.409622 -2.788866 0.277853
Cl -0.40815 2.766129 0.385443
Cl -5.164255 0.002979 -0.351704
O  0.794835 -0.01661 0.591126
O  1.318139 0.024186 -1.697759
C  3.12961 -0.006395 0.055019
C  3.395184 1.269096 0.877584
C  3.392427 -1.301973 0.846436
C  1.706345 0.003225 -0.527874
C  -0.58823 -0.010902 0.310669
C  -1.305398 -1.221437 0.180991
C  -1.304775 1.204075 0.228097
C  -2.69824 -1.23873 -0.02026
C  -2.697641 1.229811 0.027841
C  -3.368862 -0.002428 -0.092522
H  4.436836 1.259158 1.238546
H  3.241477 2.17597 0.270389
H  2.711365 1.301502 1.743573
H  3.234382 -2.193585 0.21814
H  4.434835 -1.304119 1.205325
H  2.710114 -1.352614 1.712649
H  -3.236789 -2.183708 -0.118568
H  -3.235838 2.178117 -0.033492
