program: Gaussian 09
title: 000243731
version: EM64L-G09RevD.01
frameworkgroup: C1[X(C8H11Cl2NO3)]
method: RPBEPBE
basis: SDD
operation: Freq
keyword: #p
keyword: freq=noraman
keyword: PBEPBE/SDD
title: #p freq=noraman PBEPBE/SDD
converged: YES YES NO NO
title: Mulliken charges:
elementType: Cl Cl O O O N C C C C C C C C H H H H H H H H H H H
charge: 0.035058 0.010621 -0.244954 -0.397893 -0.238742 -0.102303 -0.351358 -0.364553 -0.232428 -0.311077 -0.322118 0.124395 0.186473 -0.454914 0.216989 0.213679 0.209588 0.257290 0.268349 0.218591 0.195453 0.195889 0.219426 0.285423 0.383115
chargesum: 0.00000
title: Mulliken charges with hydrogens summed into heavy atoms:
elementType: Cl Cl O O O N C C C C C C C C
charge: 0.035058 0.010621 -0.244954 -0.014778 -0.238742 -0.102303 0.079310 0.102325 0.035921 0.102967 0.093197 0.409818 0.186473 -0.454914
polarizability: 1.37788393e+02 -1.17702338e+01 1.10193817e+02 -2.14026123e+00 -4.45237759e+00 1.18913056e+02
1716.lowfreq: -22.2735 -7.5427 0.0016 0.0021 0.0022 1.7032 27.8821 38.3823 49.9688
frequency: 26.9840 37.8636 49.9621 56.9052 89.1049 106.5142 160.2292 179.3100 239.2161 247.0878 269.5606 313.4447 316.5836 348.4766 394.0470 417.0788 455.7903 460.1393 514.9435 545.3198 592.6052 624.7401 663.7143 700.5439 762.3013 788.2457 805.4119 842.0923 856.6298 893.6873 945.4932 990.3255 1021.6277 1033.6883 1054.1246 1073.5129 1080.8532 1084.0738 1122.1800 1140.7821 1191.2071 1216.0776 1230.3206 1260.8905 1274.1134 1297.1735 1321.9043 1339.2454 1344.7388 1364.8570 1370.5412 1377.0925 1443.8311 1450.2273 1452.5606 1465.5693 1630.6002 1651.6078 2904.2699 2908.6032 2957.4145 2961.9589 3039.5914 3059.0227 3070.9001 3082.6859 3086.3067 3137.5549 3500.9759
redmass: 9.7526 4.8962 10.5932 4.6301 7.7431 9.0877 4.8793 6.4358 3.4338 3.3160 3.8788 10.4113 4.4836 4.4322 2.2901 5.3953 4.7024 2.9458 3.9903 4.0504 2.2419 1.7383 2.9985 3.2378 5.4009 4.9742 3.6909 1.5809 1.7337 2.5299 3.7511 2.9858 2.3130 3.6804 2.0180 2.6519 2.8293 3.3583 2.4077 3.5646 1.0697 1.2437 1.2418 1.4206 1.2539 1.2896 1.2548 1.2226 1.5867 1.3846 1.2635 1.5441 1.0823 1.0900 1.0880 1.0910 9.2779 8.5724 1.0689 1.0680 1.0662 1.0663 1.0924 1.0920 1.0854 1.0967 1.0982 1.0897 1.0639
irintensity: 0.3235 0.2129 2.6510 0.0668 1.1240 1.1444 3.5728 0.5459 0.8562 3.3888 12.8070 2.4047 2.3761 6.1848 0.9215 5.0284 18.5339 3.7986 13.0818 32.2737 117.6527 64.4050 9.6213 64.7659 47.3583 61.1893 40.5365 0.8039 19.7557 0.6072 24.7228 94.3655 33.4508 178.0706 15.9534 54.6744 26.6486 51.4950 30.8436 12.2342 2.8784 32.9236 25.3001 5.7638 2.9907 3.5169 8.4973 11.8919 27.5091 5.8517 0.9802 18.1311 2.6596 20.4704 2.8376 15.2145 139.9741 178.8928 32.7145 62.1720 35.5012 102.6223 30.0554 11.5742 4.3905 33.3014 29.1719 7.8113 27.8564
temp: 298.150 k
press: 1.00000 atm
elementType: 17 17 8 8 8 7 6 6 6 6 6 6 6 6 1 1 1 1 1 1 1 1 1 1 1
symmnumber: 1
zpe: 488656.8 jmol-1
zpe.correction: 0.186120 hartree
zpe.thermalcorrener: 0.200656 hartree
zpe.thermalcorrenthalpy: 0.201600 hartree
zpe.thermalcorrgfe: 0.141984 hartree
zpe.sumelectzpe: -1510.846441 hartree
zpe.sumelectthermal: -1510.831904 hartree
zpe.sumelectthermalent: -1510.830960 hartree
zpe.sumelectthermalfe: -1510.890577 hartree
dipole: -0.5432 1.3947 1.2558
dipole: 1.9538
quadrupole: -104.2087 -95.3139 -94.3968
quadrupole: -4.6126 -2.1627 1.4293
quadrupole: -6.2356 2.6592 3.5764 -4.6126 -2.1627 1.4293
hfenergy: -1511.0325605 hartree
pointgroup: C01 [X(C8H11Cl2N1O3)]
dipole: 0.1509503 0.7487616 0.0861703 debye
dipolederiv: -0.5323563 -0.4195919 -0.1061041 -0.5811687 -0.4116578 -0.045911 -0.0601149 0.0424928 -0.1692586 -0.1385872 -0.1397232 0.0658691 -0.0991157 -0.2105274 0.2699501 -0.0312636 0.2145942 -0.5869852 -0.6011637 0.0167365 0.0320791 0.0250253 -0.4129082 0.1003213 0.0460104 0.0951749 -0.7319259 -0.3695463 -0.0448364 -0.0051437 -0.0457162 -1.2800753 0.1133023 -0.0394166 0.1170409 -0.2670968 -0.3543062 -0.0357013 0.1350901 -0.0045042 -0.6880724 -0.0876779 0.1435882 0.1522415 -0.8869484 -0.7694872 -0.0292434 -0.0824033 -0.0161795 -0.5418293 -0.083809 -0.0028603 -0.1030361 -0.5213442 0.1316588 0.0608331 -0.1503671 0.0648324 0.2026321 0.1340388 -0.2912709 0.1666534 0.293871 -0.0213087 0.0894496 0.118182 0.0023133 0.3792855 -0.1322981 0.224792 -0.0845238 0.2248941 0.6214955 0.0520411 0.2405978 0.0487696 0.3087332 0.1816347 0.0394885 -0.024443 0.0056906 0.3887277 0.0133025 0.0739473 0.0757366 0.4088803 -0.2087454 0.1006351 -0.1237904 0.474877 0.459657 0.0124152 -0.103336 0.0445422 0.2716958 0.1252437 -0.0936096 0.0236404 0.5521648 -0.4273936 -0.0349856 -0.0574755 -0.0869738 -0.2901465 -0.0365436 -0.2238601 -0.1056696 -0.4162028 0.1993766 -0.0073133 -0.2874927 0.0168298 1.628825 0.0629607 -0.1837864 -0.0949689 1.0758695 0.7280047 0.723652 0.1304503 0.7710025 0.6614025 -0.3006934 0.2541596 -0.2463654 1.0698969 0.0763855 0.0443435 -0.0566738 0.0255637 -0.0437107 0.1234804 0.0071585 0.0815449 -0.0382145 -0.0354723 -0.0863312 -0.0304939 -0.0357966 -0.1163326 -0.1541221 0.0655608 -0.0701017 -0.043178 -0.0028096 -0.0892078 -0.0237815 -0.0374075 -0.1817595 0.0312968 -0.0917578 -0.0610906 0.0137781 0.0813114 -0.019963 0.089341 0.0081125 0.0804477 -0.0478194 0.0495646 -0.0208355 -0.0379953 0.0457217 -0.0000687 -0.0017334 -0.0058094 0.0420068 0.0232397 -0.0035991 0.088592 0.0027602 -0.0010732 0.0347834 0.0651797 0.080036 0.0517283 -0.0554662 0.0946582 -0.0243326 -0.1076487 -0.0087241 -0.0666912 -0.0345126 -0.1342322 -0.1538434 0.0442979 -0.1000361 -0.0586272 0.010009 -0.0321229 -0.0728292 -0.0178745 -0.1216255 -0.0984534 -0.1666012 0.0192304 -0.0428567 -0.0194059 0.0367446 0.0293533 -0.0077875 0.0712368 -0.038175 0.141607 -0.0118796 0.0905942 -0.0525791 0.1347565 -0.0332584 -0.0349937 -0.0587244 0.1013114 0.0051749 0.0360235 0.079092 0.0504379 0.3905113 0.0028346 0.049437 -0.0067473 0.3305428 -0.0368613 0.052585 -0.0910198 0.1045344 unknown
polarizability: 129.0251594|12.0365265|111.073945|10.9629639|1.0512586|126.7961613 unknown
InChI: InChI=1S/C8H11Cl2NO3/c9-7(10)5-6(8(12)13)11-1-3-14-4-2-11/h5-6,12H,1-4H2
charge 0 multiplicity 1
25 atoms
Cl -3.526148 -1.853932 -1.36187
Cl -1.978562 0.214463 -2.936182
O  3.239089 -1.550191 0.000732
O  -0.551809 3.013109 0.763916
O  -0.953561 1.282813 2.260466
N  0.938167 0.197124 0.029762
C  1.555375 -0.22174 -1.257536
C  1.11225 -0.852213 1.073282
C  -0.432653 0.765098 -0.113523
C  3.049152 -0.513305 -1.025637
C  2.614207 -1.118226 1.263271
C  -1.554151 -0.266924 -0.209673
C  -0.68291 1.667243 1.100315
C  -2.240751 -0.579339 -1.326531
H  1.451882 0.597229 -1.993263
H  1.062608 -1.131328 -1.675304
H  0.615539 -1.806794 0.780448
H  0.669739 -0.503734 2.02284
H  -0.428106 1.403968 -1.011478
H  3.519752 -0.910641 -1.940097
H  3.562876 0.421696 -0.714632
H  3.113481 -0.197498 1.634245
H  2.782323 -1.945223 1.972529
H  -1.810104 -0.797766 0.715881
H  -0.679786 3.57461 1.577438
