program: Gaussian 09
title: 000243753
version: EM64L-G09RevD.01
frameworkgroup: C1[X(C20H27FO3)]
method: RPBEPBE
basis: SDD
operation: Freq
keyword: #p
keyword: freq=noraman
keyword: PBEPBE/SDD
title: #p freq=noraman PBEPBE/SDD
converged: YES YES NO NO
title: Mulliken charges:
elementType: F O O O C C C C C C C C C C C C C C C C C C C C H H H H H H H H H H H H H H H H H H H H H H H H H H H
charge: -0.220855 -0.443530 -0.447344 -0.253091 -0.132169 0.395034 -0.209588 0.309167 -0.248398 -0.636753 -0.585181 -0.259857 -0.045411 0.026214 -0.448016 -0.839863 -0.660435 0.633186 -0.736635 -0.782301 -0.181822 -0.648896 -0.397867 0.190876 0.252244 0.231295 0.225928 0.238762 0.234575 0.219830 0.227257 0.271669 0.220681 0.224417 0.238956 0.202637 0.267158 0.218379 0.218944 0.243076 0.211751 0.207222 0.243321 0.243624 0.216219 0.277579 0.274041 0.338291 0.362782 0.260611 0.252287
chargesum: 0.00000
title: Mulliken charges with hydrogens summed into heavy atoms:
elementType: F O O O C C C C C C C C C C C C C C C C C C C C
charge: -0.220855 -0.105239 -0.084562 -0.253091 0.120076 0.395034 0.021707 0.309167 -0.022470 -0.163415 -0.138093 0.011812 0.175271 0.026214 0.015356 -0.151690 -0.198416 0.633186 -0.074341 -0.044878 0.092219 -0.388285 -0.145580 0.190876
polarizability: 2.85897918e+02 1.84010608e-01 1.97860369e+02 -2.39538302e+01 1.08365386e+00 1.69432321e+02
1716.lowfreq: -8.1158 -0.0008 -0.0008 -0.0006 2.8843 13.2294 33.3863 51.9665 69.3011
frequency: 33.3661 51.9252 69.2955 82.0066 122.3041 126.3252 139.0361 170.2994 181.4395 184.5792 198.6775 204.6560 211.6642 229.5250 237.2380 259.3933 261.9394 271.2743 274.1851 279.7292 294.8527 302.6171 305.9552 315.5736 357.6464 360.9864 375.0198 398.7453 414.5998 433.2186 466.0015 474.7193 477.6508 503.0303 520.4368 521.0493 539.7668 568.9528 583.3224 604.9909 654.0608 659.9195 681.9767 697.0199 743.3080 762.8491 780.2525 811.9235 829.7863 843.7650 855.8169 866.6571 876.0891 900.9308 907.1655 916.5442 928.9941 937.5093 954.0780 957.2393 962.9934 990.8921 1003.1087 1006.4294 1018.5152 1025.3088 1039.1765 1050.7812 1070.1632 1074.7066 1086.5565 1102.9786 1112.4427 1117.5339 1127.9211 1139.1094 1149.4816 1153.2728 1164.6721 1171.7863 1174.8801 1202.0687 1208.3225 1220.3478 1236.6264 1243.7924 1253.4878 1265.6438 1279.6849 1287.6829 1291.4746 1300.1301 1302.4625 1318.1724 1323.5448 1325.0938 1341.4626 1345.0197 1347.9784 1355.1564 1356.7047 1370.3016 1375.4442 1377.7474 1386.5926 1392.3350 1400.8228 1450.6863 1463.1929 1463.5707 1466.5560 1469.0610 1474.1794 1477.0687 1492.7969 1497.1081 1500.2359 1556.7999 1619.5088 1667.9864 2929.4037 2942.5011 2966.0205 2971.5164 2976.3729 2982.4331 2986.7656 2988.6299 2990.3736 2997.1960 2999.8139 3032.1806 3045.7289 3048.3610 3056.2460 3058.7342 3061.7686 3076.9491 3091.0761 3098.8536 3100.5676 3113.3857 3122.9541 3130.0839 3151.3750 3558.8688 3587.0943
redmass: 6.7740 4.4785 4.9825 3.2562 3.9306 2.2240 1.9331 1.8745 4.7611 4.3668 1.1245 3.0338 3.9445 2.3403 2.6207 2.8760 1.7972 1.6061 1.9465 1.8290 3.3817 2.1453 2.4367 3.1584 3.5737 3.6950 2.7539 3.0418 3.2282 3.8676 3.4769 3.7559 3.5917 3.7576 3.4176 3.6805 3.1950 2.8422 4.2810 3.8250 2.9971 4.2042 3.5241 3.5030 3.3846 3.8092 3.1250 2.1056 1.6661 2.5378 2.6401 3.0180 2.5609 1.8409 1.8042 1.8198 2.1281 1.6572 1.7575 2.2553 1.9726 2.2885 1.3798 2.7061 1.9860 2.5536 2.0917 2.8959 2.2807 2.3840 2.1290 2.3220 1.9542 1.9953 2.1060 2.2056 2.2075 1.5233 2.2071 2.0922 1.6205 1.4752 1.4966 1.4095 1.5684 1.4860 1.6015 1.3164 1.5101 1.4980 2.0911 1.5182 1.3564 1.6896 1.3455 1.4059 1.4674 1.4735 1.6637 1.4499 1.3797 1.3893 1.3953 1.4949 1.4330 1.2237 1.2032 1.0898 1.0765 1.0578 1.0869 1.0635 1.0627 1.0631 1.0595 1.0558 1.0557 8.5816 8.5296 7.4139 1.0844 1.0814 1.0650 1.0590 1.0448 1.0663 1.0560 1.0601 1.0802 1.0603 1.0363 1.0993 1.0948 1.0862 1.0990 1.0995 1.1031 1.0991 1.0991 1.0964 1.0955 1.0869 1.0992 1.0920 1.0982 1.0662 1.0660
irintensity: 1.8423 0.4429 1.1708 0.1503 1.5411 50.6684 29.5623 14.6021 3.1187 12.5939 0.3168 10.8358 0.5259 2.6426 3.5310 17.1869 53.2221 15.0195 5.2794 34.1736 4.0113 20.2421 23.6837 0.6509 3.3822 3.7704 0.4984 4.0807 0.6277 1.9330 1.9019 3.7352 4.0200 12.8017 5.8867 1.1331 3.3153 7.1683 6.1351 2.6670 1.6137 3.2456 6.6411 7.5677 11.3249 2.0728 9.4972 4.1054 12.7953 24.4627 8.0375 8.5617 14.8091 35.1018 7.2932 10.3083 11.3451 2.0392 4.7168 21.4351 47.5627 30.3676 4.1480 87.0763 4.6414 5.2429 12.5030 33.7272 1.3399 25.2901 9.3695 1.4292 16.4417 6.3669 2.8761 3.2620 4.1261 17.4868 2.4620 15.9306 21.4808 11.8909 3.2756 20.4054 10.6231 12.9924 17.1541 1.1758 6.3631 11.1449 22.8823 0.6550 11.0544 1.6038 3.0175 0.9322 4.7591 0.5412 4.1256 2.0421 2.5896 28.8267 6.6200 4.8458 12.9981 13.5452 37.7535 8.4657 16.7174 3.0767 6.0234 11.5354 11.4112 11.8160 10.9843 6.5627 5.5115 192.1658 15.0324 136.7031 25.1364 13.0366 21.5696 32.9232 23.3828 7.7164 18.0708 29.7141 48.3611 32.8901 30.7812 14.9861 24.1278 21.5670 46.2006 28.4482 19.5683 53.4523 33.5535 31.2386 16.7382 3.1897 3.4923 10.4988 12.3692 7.2746 25.0834
temp: 298.150 k
press: 1.00000 atm
elementType: 9 8 8 8 6 6 6 6 6 6 6 6 6 6 6 6 6 6 6 6 6 6 6 6 1 1 1 1 1 1 1 1 1 1 1 1 1 1 1 1 1 1 1 1 1 1 1 1 1 1 1
symmnumber: 1
zpe: 1127412.8 jmol-1
zpe.correction: 0.429409 hartree
zpe.thermalcorrener: 0.452396 hartree
zpe.thermalcorrenthalpy: 0.453340 hartree
zpe.thermalcorrgfe: 0.380095 hartree
zpe.sumelectzpe: -1101.977361 hartree
zpe.sumelectthermal: -1101.954375 hartree
zpe.sumelectthermalent: -1101.953430 hartree
zpe.sumelectthermalfe: -1102.026675 hartree
dipole: -6.3981 -0.1950 2.6807
dipole: 6.9397
quadrupole: -190.4342 -134.3929 -143.6963
quadrupole: 0.3220 14.9774 4.7400
quadrupole: -34.2597 21.7816 12.4782 0.3220 14.9774 4.7400
hfenergy: -1102.4067701 hartree
pointgroup: C01 [X(C20H27F1O3)]
dipole: -2.5187391 0.0827331 -1.0504962 debye
polarizability: 285.931809|0.0066553|197.7564165|23.8557063|2.2133619|169.502382 unknown
InChI: InChI=1S/C20H27FO3/c1-11-8-15-14-5-4-12-9-13(22)6-7-19(12,3)20(14,21)16(23)10-18(15,2)17(11)24/h6-7,9,11,14-17,23-24H,4-5,8,10H2,1-3H3
charge 0 multiplicity 1
51 atoms
F  0.814442 -0.056154 1.464735
O  -4.914351 1.138721 0.657282
O  -0.086299 2.578058 -0.970567
O  5.742607 -0.324455 1.232829
C  -1.733239 -0.756929 0.221277
C  -2.455234 0.623316 0.158085
C  -0.378439 -0.783286 -0.51792
C  0.544443 0.338544 0.041654
C  -3.763333 0.272483 0.94559
C  -1.543045 1.657958 0.858961
C  -2.839034 -1.758766 -0.180584
C  -0.121616 1.744654 0.246945
C  -4.108294 -1.221477 0.56672
C  1.97463 0.353976 -0.642244
C  0.304931 -2.167901 -0.382631
C  -2.83739 1.052261 -1.286608
C  1.742325 -2.198779 -0.967251
C  2.577006 -1.043232 -0.452413
C  -5.41864 -1.408705 -0.224994
C  1.88943 0.65041 -2.185723
C  2.838092 1.456868 -0.055129
C  3.79234 -1.231421 0.144167
C  4.048609 1.242076 0.529181
C  4.610078 -0.122548 0.679167
H  -1.501867 -0.939076 1.294471
H  -0.54488 -0.576215 -1.594372
H  -3.532642 0.326906 2.033294
H  -1.430568 1.369047 1.922306
H  -1.974655 2.679571 0.839981
H  -3.000258 -1.750299 -1.276909
H  -2.605344 -2.798219 0.108817
H  0.529328 2.2827 0.957025
H  -4.2142 -1.782967 1.51574
H  -0.315347 -2.930209 -0.889289
H  0.347209 -2.431837 0.690488
H  -2.008074 0.912751 -2.006434
H  -3.691418 0.468852 -1.664853
H  -3.158943 2.110426 -1.309384
H  1.679667 -2.151649 -2.074354
H  2.22962 -3.158237 -0.717628
H  -5.388974 -0.889219 -1.198909
H  -5.591465 -2.484787 -0.414878
H  -6.280318 -1.005854 0.332535
H  2.902131 0.5680 -2.617412
H  1.236154 -0.066018 -2.712461
H  1.50404 1.667445 -2.351977
H  2.460901 2.478603 -0.19269
H  -4.74525 2.036413 1.03977
H  -0.938144 2.480583 -1.462588
H  4.213542 -2.237854 0.260005
H  4.664432 2.067474 0.90478
