program: Gaussian 09
title: 000243714
version: EM64L-G09RevD.01
frameworkgroup: C1[X(C12H23NO2)]
method: RPBEPBE
basis: SDD
operation: Freq
keyword: #p
keyword: freq=noraman
keyword: PBEPBE/SDD
title: #p freq=noraman PBEPBE/SDD
converged: YES YES NO NO
title: Mulliken charges:
elementType: O O N C C C C C C C C C C C C H H H H H H H H H H H H H H H H H H H H H H H
charge: -0.292623 -0.220172 -0.091740 -0.393227 -0.418317 -0.334633 -0.346662 -0.340397 -0.334542 0.194022 -0.574648 -0.696147 -0.694719 0.242203 -0.762874 0.205550 0.251613 0.215651 0.214648 0.181404 0.229356 0.190203 0.258008 0.204749 0.189735 0.193644 0.188254 0.240387 0.239030 0.208876 0.217694 0.216706 0.209989 0.214337 0.225997 0.245980 0.290447 0.232214
chargesum: 0.00000
title: Mulliken charges with hydrogens summed into heavy atoms:
elementType: O O N C C C C C C C C C C C C
charge: -0.292623 -0.220172 -0.091740 0.063936 0.011982 0.076128 0.101549 0.054087 0.047356 0.194022 -0.095231 -0.052870 -0.044396 0.242203 0.005768
polarizability: 1.66382854e+02 -9.02310882e-01 1.57889680e+02 -5.30881116e-01 8.87744141e-01 1.12381409e+02
1716.lowfreq: -14.8690 -10.3248 -4.2968 0.0003 0.0005 0.0007 22.1504 33.8806 37.3657
frequency: 21.9878 33.8136 37.2681 46.5206 58.4484 66.3630 73.8358 84.4129 106.6414 125.9641 146.7902 172.8667 179.4492 225.5458 230.0709 237.7806 252.8362 298.4095 333.4966 376.5044 395.2142 419.2707 440.5894 476.3719 493.8877 561.1972 595.2948 677.8900 734.7010 741.3755 768.5775 787.0542 793.1324 808.3443 895.7920 899.1530 901.7740 918.1788 925.9508 964.7038 1007.9207 1012.7186 1027.7697 1033.5899 1069.8296 1072.8577 1096.9630 1110.4926 1114.2551 1114.8763 1172.5786 1195.3978 1207.4801 1232.8496 1238.0890 1250.6379 1265.5409 1269.9240 1280.0754 1287.6087 1298.6568 1304.2169 1337.4421 1343.9888 1361.7627 1365.5512 1373.0356 1389.6647 1392.3414 1409.4465 1438.9872 1445.2934 1449.3626 1455.3554 1466.6836 1471.2817 1475.8464 1476.5673 1477.9058 1480.5063 1487.1862 1488.7123 1498.7277 1576.1948 1629.6108 2958.9576 2964.4727 2972.5559 2973.9780 2974.0976 2974.9421 2976.5790 2993.1454 2997.4925 3004.1715 3010.8459 3032.3489 3035.1347 3041.9812 3056.2424 3057.0458 3069.8189 3072.0471 3073.9269 3077.3090 3079.2105 3121.5204 3124.2567
redmass: 3.6076 3.7980 3.3557 4.4882 2.2569 1.6537 3.8396 3.1046 2.3201 2.4266 3.2850 1.0960 3.6852 2.1695 1.2398 1.2108 3.2159 3.1331 3.6596 2.8853 2.7454 2.1270 2.9446 3.5512 3.6120 3.6996 3.9717 4.3942 1.0798 1.0718 3.7215 1.2344 1.2239 3.3191 1.7771 1.7930 1.7181 1.4740 1.2570 2.1004 2.6424 2.8408 2.2056 2.3142 2.5278 2.5032 1.7568 2.1141 2.3808 1.4798 2.0318 2.4137 2.1767 1.5266 1.5166 1.5003 1.2782 1.2638 1.2670 1.0805 1.0964 1.2760 1.3766 1.4673 1.4418 1.3691 1.2726 1.2140 1.2166 2.4198 1.0808 1.0991 1.1025 1.0838 1.0729 1.0651 1.0682 1.0418 1.0427 1.0747 1.0782 1.0852 1.1109 5.6822 7.3980 1.0590 1.0589 1.0571 1.0388 1.0403 1.0583 1.0393 1.0637 1.0642 1.0964 1.0961 1.0929 1.0677 1.0988 1.0962 1.1040 1.1005 1.1000 1.0996 1.1003 1.1027 1.1007 1.1009
irintensity: 0.2377 1.7230 0.6865 2.0795 1.8704 0.4673 2.4561 8.2001 0.1237 0.1201 1.2817 0.8062 4.2342 0.1903 0.0766 0.3749 0.6182 7.6264 1.5777 5.9362 0.6432 3.1389 12.0197 5.1926 8.6276 6.6234 12.9608 1.0476 10.8841 10.1349 0.6090 0.4913 0.5855 4.1120 12.1345 0.8190 12.0588 2.3061 2.6193 8.7533 0.8210 5.2395 1.5239 1.4167 0.0337 0.4793 19.5260 28.3224 12.8567 20.8117 54.8233 39.7691 191.1575 48.6289 4.8172 15.0961 1.0388 1.3215 16.8783 2.0130 0.0449 23.0649 2.2370 0.9094 16.2544 26.7856 91.8552 10.0040 11.3983 65.9724 16.3244 44.4454 12.7235 23.2483 1.0407 0.7970 6.7022 12.4283 12.2526 1.7824 15.0917 7.8395 20.1780 303.5754 122.4606 32.6543 18.9423 25.4473 33.7545 25.4321 7.9685 34.3488 60.1462 28.2446 21.2043 8.9697 0.2995 7.8773 16.2520 6.1156 28.0931 44.4717 73.9440 48.2862 45.6127 52.4694 15.9766 5.5326
temp: 298.150 k
press: 1.00000 atm
elementType: 8 8 7 6 6 6 6 6 6 6 6 6 6 6 6 1 1 1 1 1 1 1 1 1 1 1 1 1 1 1 1 1 1 1 1 1 1 1
symmnumber: 1
zpe: 872707.6 jmol-1
zpe.correction: 0.332397 hartree
zpe.thermalcorrener: 0.351523 hartree
zpe.thermalcorrenthalpy: 0.352468 hartree
zpe.thermalcorrgfe: 0.282058 hartree
zpe.sumelectzpe: -675.061555 hartree
zpe.sumelectthermal: -675.042428 hartree
zpe.sumelectthermalent: -675.041484 hartree
zpe.sumelectthermalfe: -675.111893 hartree
dipole: -1.4526 2.0087 1.5999
dipole: 2.9504
quadrupole: -101.2940 -92.3294 -91.4475
quadrupole: -6.2873 4.1208 -2.2428
quadrupole: -6.2704 2.6942 3.5761 -6.2873 4.1208 -2.2428
hfenergy: -675.3939513 hartree
pointgroup: C01 [X(C12H23N1O2)]
dipole: -0.7972345 -0.6163715 -0.5761055 debye
polarizability: 165.9722786|-1.8423115|157.902143|1.5613945|-4.1824547|112.7795213 unknown
InChI: InChI=1S/C12H23NO2/c1-4-6-8-13(9-7-5-2)12(15)10-11(3)14/h4-10H2,1-3H3
charge 0 multiplicity 1
38 atoms
O  0.323579 2.112217 -0.178386
O  3.557956 -0.405461 0.185538
N  -0.344034 -0.111909 -0.316372
C  -1.583873 0.221275 0.433624
C  -0.17753 -1.526851 -0.733404
C  -2.758342 0.615228 -0.490423
C  0.634842 -2.381157 0.267103
C  -4.046054 0.924107 0.30674
C  0.683258 -3.869708 -0.147059
C  0.551657 0.91476 -0.558448
C  1.880505 0.591663 -1.278423
C  -5.225966 1.32294 -0.605484
C  1.502214 -4.727556 0.841493
C  3.048967 0.653703 -0.271236
C  3.508201 2.039062 0.135401
H  -1.856585 -0.658364 1.048324
H  -1.353179 1.062112 1.110143
H  -1.193444 -1.952905 -0.84257
H  0.284723 -1.577141 -1.736375
H  -2.959403 -0.201947 -1.213799
H  -2.460305 1.504199 -1.07818
H  0.17914 -2.290597 1.274182
H  1.664459 -1.981839 0.344661
H  -3.840684 1.74219 1.026296
H  -4.328489 0.037959 0.912088
H  1.125838 -3.954961 -1.161043
H  -0.348957 -4.271089 -0.221376
H  1.891442 -0.396128 -1.760151
H  2.01071 1.380172 -2.04015
H  -5.471136 0.510795 -1.315824
H  -6.135341 1.543388 -0.016967
H  -4.979635 2.223753 -1.198095
H  1.065844 -4.686805 1.857241
H  1.53249 -5.787264 0.528257
H  2.543386 -4.362051 0.909546
H  4.187032 1.987089 1.000339
H  2.623989 2.666516 0.355611
H  4.036327 2.519405 -0.711721
