program: Gaussian 09
title: 000243710
version: EM64L-G09RevD.01
frameworkgroup: C1[X(C11H18O3)]
method: RPBEPBE
basis: SDD
operation: Freq
keyword: #pfreq=noraman
keyword: PBEPBE/SDD
title: #p freq=noraman PBEPBE/SDD
converged: YES YES NO NO
title: Mulliken charges:
elementType: O O O C C C C C C C C C C C H H H H H H H H H H H H H H H H H H
charge: -0.267049 -0.253754 -0.195008 0.010975 -0.428567 -0.433091 0.035790 -0.461509 -0.443560 -0.742449 0.277647 -0.591218 0.222545 -0.756751 0.197033 0.193350 0.206738 0.206577 0.195456 0.236121 0.213767 0.212738 0.233602 0.211187 0.216363 0.208426 0.215057 0.236469 0.276454 0.250908 0.282281 0.233474
chargesum: 0.00000
title: Mulliken charges with hydrogens summed into heavy atoms:
elementType: O O O C C C C C C C C C C C
charge: -0.267049 -0.253754 -0.195008 0.208008 -0.028480 -0.031058 0.271911 -0.035004 0.001229 -0.102603 0.277647 -0.078294 0.222545 0.009912
polarizability: 1.61754548e+02 3.60852323e+00 1.09475276e+02 -3.58077674e-01 2.03060460e+00 1.10926141e+02
1716.lowfreq: -27.6261 -8.0104 -0.0006 0.0006 0.0008 9.6204 18.5198 30.2064 50.6511
frequency: 18.4473 27.9844 50.5917 64.8412 68.6173 145.4497 154.6244 176.2109 200.8457 215.9589 239.9751 257.9571 277.3267 340.9945 359.7752 407.3822 428.8886 456.0563 462.7047 478.6829 513.6593 555.6126 616.1003 703.3675 764.7923 787.6020 797.7251 834.6832 854.4322 887.5314 891.9132 921.3433 933.0307 962.4589 972.4477 1010.3280 1016.1723 1026.7906 1031.3441 1058.0249 1089.3901 1099.7904 1112.4417 1155.9446 1181.4453 1184.8034 1220.4364 1226.3904 1243.4503 1251.3274 1275.3471 1297.1129 1298.3775 1303.0811 1314.1800 1336.9931 1343.7747 1349.1008 1366.7210 1373.0119 1388.7357 1433.3064 1447.1292 1454.5343 1459.9981 1465.3525 1469.7488 1475.3661 1478.4168 1480.0081 1612.6345 1647.0430 2947.1776 2961.4669 2966.6241 2971.0912 2980.2627 2990.0066 2992.0927 3011.9454 3018.3299 3029.6114 3036.0912 3056.1751 3061.5297 3064.3924 3065.8577 3068.0312 3125.4297 3127.6315
redmass: 4.1936 4.5746 3.7906 4.6773 4.7946 1.0449 4.0005 3.8694 1.2046 1.4646 4.7738 2.7465 2.8096 3.7310 2.9173 1.7201 2.8938 2.2871 3.2379 3.8700 3.4255 2.7614 4.0490 5.0713 2.6265 1.4740 3.5166 2.4951 2.5948 1.6688 2.0424 1.4306 2.9915 1.4526 2.3776 1.9812 1.6587 2.2326 2.0386 1.0607 2.2762 2.0352 2.2677 2.2691 2.5362 1.9799 1.4055 1.7639 1.2847 1.3791 1.5009 1.2562 1.3946 1.2572 1.2725 1.4688 1.5901 1.6378 1.5287 1.2638 1.2175 1.0864 1.0600 1.0729 1.0840 1.0913 1.0811 1.0495 1.0599 1.0962 9.6981 7.8706 1.0799 1.0633 1.0440 1.0575 1.0378 1.0618 1.0646 1.0834 1.0624 1.0970 1.0976 1.1022 1.0992 1.0946 1.1018 1.0993 1.1000 1.1008
irintensity: 2.2593 1.8415 2.3773 1.6317 2.3240 0.3072 3.2085 5.9191 0.0628 0.2427 0.9481 4.4270 2.3777 7.6480 0.9993 0.1629 7.1270 0.1803 0.4727 8.7992 5.0097 4.7687 13.4417 2.8010 1.7325 0.4611 7.0832 4.0538 2.5242 9.6832 12.6851 6.2382 22.8242 2.5091 96.0589 36.4637 9.8311 15.4176 1.8504 0.1872 75.6367 184.0951 12.1595 0.5024 312.2947 40.2665 9.8503 39.9947 0.5841 4.0634 113.5791 9.7577 6.1813 8.7722 0.2527 0.6078 0.9939 1.2546 6.0298 82.2726 10.8372 16.2944 32.0376 23.2544 0.7355 11.7258 9.7321 22.8814 9.7682 1.7930 229.0710 97.9514 4.3455 24.1920 14.6167 93.6946 6.4271 10.4800 14.5398 14.5191 4.0913 55.1868 27.1229 22.1569 34.9203 5.2873 79.8208 42.2013 7.4523 3.4812
temp: 298.150 k
press: 1.00000 atm
elementType: 8 8 8 6 6 6 6 6 6 6 6 6 6 6 1 1 1 1 1 1 1 1 1 1 1 1 1 1 1 1 1 1
symmnumber: 1
zpe: 713463.7 jmol-1
zpe.correction: 0.271744 hartree
zpe.thermalcorrener: 0.287121 hartree
zpe.thermalcorrenthalpy: 0.288065 hartree
zpe.thermalcorrgfe: 0.227109 hartree
zpe.sumelectzpe: -654.544620 hartree
zpe.sumelectthermal: -654.529243 hartree
zpe.sumelectthermalent: -654.528299 hartree
zpe.sumelectthermalfe: -654.589255 hartree
dipole: 1.9650 0.9866 -1.5068
dipole: 2.6655
quadrupole: -80.2262 -82.6540 -94.0046
quadrupole: -2.8073 10.2454 -1.1094
quadrupole: 5.4021 2.9743 -8.3763 -2.8073 10.2454 -1.1094
hfenergy: -654.8163644 hartree
pointgroup: C01 [X(C11H18O3)]
dipole: -0.7422708 0.4743745 0.5690054 debye
polarizability: 161.3933969|-0.1318652|108.3210945|-5.4983284|-1.3515915|112.4414735 unknown
InChI: InChI=1S/C11H18O3/c1-8-3-5-10(6-4-8)14-11(13)7-9(2)12/h8,10H,3-7H2,1-2H3
charge 0 multiplicity 1
32 atoms
O  0.392973 0.997592 -0.785295
O  1.681663 0.348873 1.05266
O  3.772782 -0.409705 -2.452949
C  -3.612469 -0.586189 -0.286061
C  -3.368729 0.935329 -0.10815
C  -2.431594 -1.385198 0.323592
C  -0.869332 0.564296 -0.078797
C  -2.007819 1.383035 -0.697903
C  -1.067904 -0.949213 -0.26737
C  -4.962598 -1.017699 0.323805
C  1.590711 0.816882 -0.109522
C  2.767425 1.250771 -0.979527
C  3.712914 0.063458 -1.290843
C  4.545102 -0.460748 -0.135113
H  -3.634773 -0.798591 -1.377557
H  -3.405855 1.179663 0.974784
H  -4.184565 1.50838 -0.589416
H  -2.577402 -2.469033 0.151851
H  -2.426511 -1.236705 1.424208
H  -0.743433 0.796935 0.996759
H  -2.002824 1.227885 -1.794429
H  -1.838124 2.460712 -0.517545
H  -0.242145 -1.500201 0.217736
H  -1.037871 -1.17802 -1.350903
H  -5.145315 -2.097797 0.171271
H  -4.981397 -0.824042 1.413903
H  -5.805278 -0.464087 -0.13094
H  3.335949 2.012479 -0.4135
H  2.399458 1.676321 -1.923983
H  5.035445 -1.406288 -0.412112
H  3.913253 -0.590692 0.762189
H  5.322162 0.2842 0.126856
