program: Gaussian 09
title: 000243717
version: EM64L-G09RevD.01
frameworkgroup: C1[X(C14H24O4)]
method: RPBEPBE
basis: SDD
operation: Freq
keyword: #pfreq=noraman
keyword: PBEPBE/SDD
title: #p freq=noraman PBEPBE/SDD
converged: YES YES NO NO
title: Mulliken charges:
elementType: O O O O C C C C C C C C C C C C C C H H H H H H H H H H H H H H H H H H H H H H H H
charge: -0.281397 -0.281405 -0.250805 -0.250512 -0.030580 -0.030681 -0.451002 -0.451014 -0.392113 -0.392202 0.270915 0.270715 -0.500590 -0.501282 -0.345483 -0.344987 -0.684670 -0.685063 0.259103 0.259044 0.215308 0.219598 0.214968 0.219806 0.211312 0.197488 0.211395 0.197367 0.258710 0.235704 0.259124 0.236123 0.208509 0.219115 0.219001 0.208477 0.211358 0.208734 0.220879 0.211578 0.208714 0.220743
chargesum: 0.00000
title: Mulliken charges with hydrogens summed into heavy atoms:
elementType: O O O O C C C C C C C C C C C C C C
charge: -0.281397 -0.281405 -0.250805 -0.250512 0.228523 0.228364 -0.016096 -0.016241 0.016686 0.016559 0.270915 0.270715 -0.006176 -0.006035 0.082140 0.082491 -0.043700 -0.044027
polarizability: 2.00094317e+02 -7.16113336e-02 1.51178455e+02 -1.11048996e-02 -4.49578288e+00 1.33881721e+02
1716.lowfreq: -17.8919 -7.9604 -3.8946 -0.0008 -0.0006 -0.0003 18.2844 23.1353 28.7914
frequency: 18.1333 22.5506 27.8118 30.9259 41.5731 61.2046 71.5149 77.8082 93.0883 112.0531 116.4654 155.8641 184.4508 221.7502 225.7621 226.9799 239.1665 262.1115 299.6013 319.3337 338.7652 349.4387 370.8737 413.1353 441.6918 460.4459 524.1745 551.9624 552.7400 563.6509 671.8955 678.9821 736.4654 738.2981 783.7313 828.8452 838.1022 862.8512 865.8295 870.3013 872.4670 880.8751 886.2269 911.2715 937.6789 958.1561 973.6111 990.4347 1051.5062 1053.0468 1054.4434 1064.4899 1088.9660 1095.9380 1104.6660 1108.3597 1113.0523 1128.7955 1138.1924 1145.5297 1156.2775 1209.4491 1221.1733 1221.8506 1239.4418 1243.1355 1278.8788 1280.5491 1282.3951 1285.3320 1294.1063 1298.5775 1307.6308 1331.1015 1335.9335 1342.3708 1342.7517 1358.2646 1362.7536 1366.6336 1389.9377 1390.1734 1441.4477 1444.2146 1467.2821 1467.4812 1472.4326 1472.7635 1474.1819 1477.3615 1477.7097 1477.9618 1486.1949 1486.3012 1632.7934 1644.0546 2973.9025 2974.4665 2977.8488 2980.1288 2980.5919 2981.7130 2991.7501 2992.8298 2998.5070 2999.3701 3018.9570 3030.8474 3034.2748 3034.8671 3044.4340 3047.5025 3053.0354 3053.7171 3060.7383 3065.4126 3076.1535 3076.4531 3076.8154 3077.5735
redmass: 3.5756 1.7814 3.6621 1.8422 2.8107 4.8951 4.0889 6.6125 2.9753 3.2267 3.4560 2.9849 3.9444 3.3514 1.1123 1.1815 2.9173 5.5526 4.6073 1.8281 3.7445 3.5874 3.0758 3.9072 3.2216 2.9984 4.4309 2.9271 2.9517 2.2989 5.8681 5.4145 1.1732 1.1701 1.7491 2.8374 2.4231 1.6480 1.3295 2.2326 2.4523 2.3014 1.6916 2.0188 2.3922 2.4233 3.8101 2.8000 1.4557 2.2105 2.3811 1.5371 2.8086 1.8782 1.8588 2.5279 2.5092 2.3533 2.6064 2.8399 1.7929 1.4571 1.3253 1.3294 1.3713 1.2629 1.2671 1.1865 1.1397 1.1543 1.3713 1.4054 1.2612 1.4053 1.4601 1.4856 1.4888 1.5624 1.7519 1.5388 1.2135 1.2137 1.0859 1.0825 1.0878 1.0881 1.0806 1.0538 1.0524 1.0437 1.0440 1.0930 1.0783 1.0772 10.1738 9.7058 1.0358 1.0357 1.0671 1.0606 1.0646 1.0644 1.0630 1.0623 1.0611 1.0611 1.0842 1.0856 1.0960 1.0961 1.0956 1.1000 1.0987 1.0989 1.1015 1.1017 1.0989 1.1016 1.0990 1.1017
irintensity: 0.0634 0.8268 1.2205 0.3027 0.2950 0.1157 0.5039 4.5684 0.2735 4.4255 0.3790 1.3358 1.0146 3.4999 0.4100 0.4014 3.0941 16.8930 0.3521 1.4820 1.4184 4.4625 6.6500 8.5785 1.7813 0.1171 0.4603 4.7586 3.6039 0.1610 0.1173 6.9241 19.0030 5.9452 0.5427 14.1594 2.8056 0.7271 1.0284 3.3456 4.6576 0.0111 6.9028 6.8837 21.4269 0.1474 167.0304 50.0543 4.6924 2.0553 12.2365 0.6692 63.2210 112.1059 0.8666 40.6510 33.2185 25.1640 100.3405 330.7017 5.3695 0.7633 0.4106 6.6024 0.0011 1.4819 2.6013 28.2350 4.2143 0.3169 14.2398 78.3772 1.0704 0.3396 0.4513 0.4972 0.9367 46.8666 16.5543 13.7614 10.0330 6.0167 52.0426 1.6122 9.1159 6.6315 21.9244 3.4696 5.5448 18.8806 5.2112 3.9995 4.9422 26.9065 65.5079 230.7968 37.6933 37.5669 28.0585 36.4304 2.9998 3.3177 31.7320 0.2318 23.6404 23.0761 12.5614 12.3051 1.3908 1.0398 57.2561 45.4336 0.8055 0.4207 0.5984 71.2932 45.3906 113.2170 58.8401 38.5840
temp: 298.150 k
press: 1.00000 atm
elementType: 8 8 8 8 6 6 6 6 6 6 6 6 6 6 6 6 6 6 1 1 1 1 1 1 1 1 1 1 1 1 1 1 1 1 1 1 1 1 1 1 1 1
symmnumber: 1
zpe: 944277.2 jmol-1
zpe.correction: 0.359656 hartree
zpe.thermalcorrener: 0.380558 hartree
zpe.thermalcorrenthalpy: 0.381502 hartree
zpe.thermalcorrgfe: 0.306012 hartree
zpe.sumelectzpe: -847.371314 hartree
zpe.sumelectthermal: -847.350412 hartree
zpe.sumelectthermalent: -847.349468 hartree
zpe.sumelectthermalfe: -847.424958 hartree
dipole: 1.9424 -0.0327 -0.0044
dipole: 1.9427
quadrupole: -95.0180 -103.5108 -118.2809
quadrupole: -0.0484 -0.0376 -2.6045
quadrupole: 10.5852 2.0924 -12.6777 -0.0484 -0.0376 -2.6045
hfenergy: -847.7309703 hartree
pointgroup: C01 [X(C14H24O4)]
dipole: -0.0147234 0.7633592 0.0353682 debye
polarizability: 150.8112248|-0.4170558|199.9605362|5.1283604|2.9582581|134.3827324 unknown
InChI: InChI=1S/C14H24O4/c1-3-7-13(15)17-11-9-5-6-10-12(11)18-14(16)8-4-2/h11-12H,3-10H2,1-2H3
charge 0 multiplicity 1
42 atoms
O  -1.501126 0.729707 -0.36873
O  1.463281 0.733023 0.309883
O  -1.225015 -0.723798 1.446573
O  1.188819 -0.561655 -1.6222
C  -0.748993 1.832656 0.305738
C  0.685747 1.877073 -0.259595
C  -1.531553 3.120599 -0.007396
C  1.435634 3.149043 0.175345
C  -0.768691 4.381561 0.459742
C  0.640807 4.428584 -0.174446
C  -1.630259 -0.506352 0.281402
C  1.597324 -0.442365 -0.444167
C  -2.297608 -1.504734 -0.647524
C  2.270845 -1.514131 0.394294
C  -2.824076 -2.760551 0.076156
C  2.785442 -2.708339 -0.434277
C  -3.409308 -3.788394 -0.914934
C  3.357414 -3.825861 0.462554
H  -0.707904 1.619403 1.391124
H  0.649949 1.766184 -1.360347
H  -1.698904 3.17133 -1.101276
H  -2.526615 3.056134 0.469021
H  1.60011 3.101897 1.269823
H  2.432419 3.154098 -0.301703
H  -1.346928 5.284784 0.189532
H  -0.674386 4.378212 1.564824
H  1.196814 5.317126 0.178296
H  0.545077 4.524157 -1.275251
H  -1.540479 -1.783715 -1.409537
H  -3.103285 -0.988773 -1.201999
H  1.518221 -1.851675 1.136993
H  3.082614 -1.047375 0.982469
H  -3.594803 -2.464336 0.813215
H  -2.001792 -3.215124 0.659047
H  1.959026 -3.100889 -1.055244
H  3.560444 -2.357972 -1.142673
H  -2.644395 -4.121076 -1.641703
H  -4.252177 -3.35848 -1.488424
H  -3.783864 -4.683049 -0.385435
H  2.586363 -4.21729 1.152791
H  4.200856 -3.457378 1.076638
H  3.727751 -4.671959 -0.144201
