program: Gaussian 09
title: 000243721
version: EM64L-G09RevD.01
frameworkgroup: C1[X(C18H21NO3)]
method: RPBEPBE
basis: SDD
operation: Freq
keyword: #p
keyword: freq=noraman
keyword: PBEPBE/SDD
title: #p freq=noraman PBEPBE/SDD
converged: YES YES NO NO
title: Mulliken charges:
elementType: O O O N C C C C C C C C C C C C C C C C C C H H H H H H H H H H H H H H H H H H H H H
charge: -0.322126 -0.445255 -0.321493 -0.455236 -0.003293 -0.426278 -0.345178 -0.354050 -0.690589 0.308531 0.470415 0.373332 0.336815 -0.390462 -0.379277 -0.365624 -0.472090 -0.393185 -0.394684 -0.235735 -0.234970 -0.242244 0.243605 0.210204 0.200225 0.217451 0.195293 0.215299 0.197569 0.210205 0.220006 0.211253 0.332013 0.240357 0.240293 0.299133 0.223198 0.372392 0.238002 0.234743 0.226093 0.225302 0.230039
chargesum: 0.00000
title: Mulliken charges with hydrogens summed into heavy atoms:
elementType: O O O N C C C C C C C C C C C C C C C C C C
charge: -0.322126 -0.072862 -0.321493 -0.123222 0.240312 -0.015850 0.067566 0.058818 -0.049125 0.308531 0.470415 0.373332 0.336815 -0.150104 -0.138984 -0.066491 -0.248892 -0.155183 -0.159941 -0.009642 -0.009667 -0.012206
polarizability: 3.87851404e+02 -1.81261438e+00 1.85385051e+02 5.20800326e+00 2.77637646e+01 1.33161546e+02
1716.lowfreq: -7.5359 -0.0005 0.0006 0.0010 1.9496 7.1750 20.8951 25.1723 40.1473
frequency: 19.6523 25.1318 40.1337 59.5339 67.6322 68.4592 83.3349 87.6167 112.4359 116.8349 134.9920 152.3035 199.2186 211.9192 226.6502 231.5542 287.4219 309.4263 326.5546 332.7990 370.7332 391.3153 405.0536 412.8204 427.3903 465.2315 499.8563 529.4965 553.8333 596.1051 613.8035 634.5066 647.0748 658.0830 701.3235 701.8447 708.5576 712.7284 728.8128 749.7679 770.6862 782.1555 827.7646 848.3580 856.2728 859.7818 870.8804 893.9099 918.4912 948.7092 958.1456 972.6946 984.0168 986.8580 988.1032 992.3313 993.4124 993.6117 1016.0177 1022.3988 1041.7195 1070.9222 1084.1396 1085.0476 1115.8495 1131.0619 1140.8372 1173.6442 1178.6699 1191.2634 1200.4794 1204.6351 1227.7588 1250.9848 1261.1447 1291.0114 1293.4757 1304.8936 1306.3989 1319.2879 1334.9953 1352.7947 1363.4843 1365.6701 1376.0283 1391.1168 1419.3820 1424.0150 1437.3585 1449.0102 1458.9628 1474.4457 1477.3621 1478.4019 1486.1839 1502.4725 1525.6993 1579.1894 1592.9018 1612.5241 1625.9156 1639.8097 2941.2001 2973.1250 2975.7549 2982.7782 3008.0105 3027.2111 3047.4807 3059.3809 3073.3857 3075.5252 3113.8612 3122.4127 3126.9029 3139.5054 3141.6660 3148.7210 3150.3215 3165.3408 3192.8904 3377.5729 3540.0237
redmass: 4.4528 4.4968 4.4776 4.1622 4.2569 2.4281 3.1879 4.5419 4.8037 4.7314 2.7577 4.1866 3.9224 4.7941 2.8444 1.4287 4.0149 4.2641 5.2161 4.1138 5.8181 4.1198 2.8715 2.9865 4.3544 3.2097 3.3085 3.1871 2.4902 5.6877 6.4930 6.6432 1.4261 1.1204 3.3616 1.9072 4.5229 2.9537 3.1954 1.5641 1.9328 3.4716 1.4082 1.3113 1.9754 1.4975 2.1039 1.9533 1.4456 1.3853 2.0911 1.4357 1.5608 2.9467 3.2523 4.5609 2.2300 2.1737 3.7700 3.5292 1.8974 2.9344 1.8467 1.6256 2.2535 1.3789 2.1129 1.0533 2.8223 1.1119 1.0634 1.1356 1.3372 1.2343 1.9615 1.1390 3.0832 1.3310 1.4673 1.3674 1.2991 1.3257 2.2432 1.9574 9.0302 1.2168 2.0238 1.7002 2.3581 1.0846 1.0806 1.0545 2.1505 1.0422 1.0807 2.2037 3.1333 4.8052 5.6456 5.9923 6.1802 7.6059 1.0689 1.0392 1.0584 1.0621 1.0864 1.0950 1.1005 1.0941 1.1010 1.0993 1.0887 1.0847 1.0872 1.0915 1.0910 1.0956 1.0950 1.1016 1.0943 1.0659 1.0760
irintensity: 0.0967 0.0745 0.5044 0.0598 0.5921 0.3911 1.1900 2.3548 0.1320 2.2093 4.9616 2.9416 0.5672 3.0306 4.1961 2.3801 5.7290 1.6832 10.1327 3.2676 10.9761 1.3213 0.4472 0.3985 2.8228 5.9717 20.8379 8.3954 7.5545 9.0076 0.1065 1.1400 46.0345 93.8318 107.9624 14.2223 10.7688 12.7156 8.2333 6.9767 85.2645 26.7261 31.8127 0.3123 8.3384 39.7072 7.1728 8.0889 1.4554 2.1400 18.0728 0.0530 3.2207 46.9113 23.3382 142.1962 5.7645 34.0665 20.6174 131.9353 0.9121 7.8643 86.0203 9.8946 17.1778 26.4673 58.2731 0.3465 460.5590 7.6359 32.4764 30.7374 8.7716 8.3510 5.0426 0.6523 0.5136 5.5252 4.3983 45.3060 31.4959 37.8628 61.7112 35.9747 14.4570 10.2476 149.7845 33.8872 26.8734 1.1531 8.2363 4.0014 46.8931 12.0508 12.6163 369.6604 375.0868 36.2231 37.4112 20.8848 108.7104 228.0836 47.7984 35.1565 7.8253 55.4912 12.5792 11.7147 7.4109 54.8651 88.7060 57.2933 26.2448 6.2543 1.1894 20.1191 4.0418 23.2980 27.9273 29.2872 2.9246 324.4423 31.2436
temp: 298.150 k
press: 1.00000 atm
elementType: 8 8 8 7 6 6 6 6 6 6 6 6 6 6 6 6 6 6 6 6 6 6 1 1 1 1 1 1 1 1 1 1 1 1 1 1 1 1 1 1 1 1 1
symmnumber: 1
zpe: 925374.7 jmol-1
zpe.correction: 0.352457 hartree
zpe.thermalcorrener: 0.373631 hartree
zpe.thermalcorrenthalpy: 0.374575 hartree
zpe.thermalcorrgfe: 0.299940 hartree
zpe.sumelectzpe: -977.346555 hartree
zpe.sumelectthermal: -977.325381 hartree
zpe.sumelectthermalent: -977.324437 hartree
zpe.sumelectthermalfe: -977.399071 hartree
dipole: 0.3856 -4.6173 -0.3671
dipole: 4.6479
quadrupole: -113.1178 -137.8105 -130.8022
quadrupole: 15.2233 0.2644 7.0564
quadrupole: 14.1257 -10.5670 -3.5587 15.2233 0.2644 7.0564
hfenergy: -977.6990118 hartree
pointgroup: C01 [X(C18H21N1O3)]
dipole: 0.1473406 -1.4883504 -1.052137 debye
polarizability: 387.5839249|-7.5186194|147.4202877|6.6922718|36.0436828|171.3937881 unknown
InChI: InChI=1S/C18H21NO3/c1-2-6-17(13-20)22-18(21)19-16-11-9-15(10-12-16)14-7-4-3-5-8-14/h3-5,7-12,17,19-20H,2,6,13H2,1H3
charge 0 multiplicity 1
43 atoms
O  -3.623443 0.123335 -0.399734
O  -4.428734 2.934845 1.235483
O  -2.208696 1.320338 1.062479
N  -1.402261 -0.238032 -0.520616
C  -4.87183 0.65606 0.272033
C  -6.02125 -0.120536 -0.385305
C  -5.953455 -1.650139 -0.180725
C  -4.985966 2.191699 0.114596
C  -7.140399 -2.38179 -0.842838
C  -2.383946 0.477304 0.136165
C  0.00827 -0.163068 -0.344196
C  2.861856 -0.124088 -0.107171
C  4.346413 -0.099507 0.018511
C  2.036517 0.707127 0.698397
C  2.21341 -0.98053 -1.039224
C  0.632386 0.698251 0.594875
C  0.81301 -1.00239 -1.15918
C  4.971262 0.165319 1.269309
C  5.182117 -0.338403 -1.108269
C  6.376817 0.19253 1.389042
C  6.58792 -0.314851 -0.989509
C  7.194184 -0.048265 0.260151
H  -4.791333 0.413659 1.350909
H  -6.044757 0.115716 -1.468337
H  -6.967682 0.263298 0.045555
H  -4.999785 -2.029579 -0.592349
H  -5.938839 -1.871335 0.906021
H  -6.053915 2.470623 0.086667
H  -4.527247 2.484628 -0.856139
H  -8.105839 -2.034876 -0.42831
H  -7.078418 -3.473591 -0.683154
H  -7.159861 -2.200808 -1.934187
H  -1.750048 -0.889557 -1.227892
H  2.50161 1.402799 1.4056
H  2.809276 -1.660935 -1.657037
H  0.020454 1.350047 1.220882
H  0.340915 -1.681243 -1.880937
H  -3.504338 2.581594 1.387273
H  4.352754 0.320807 2.160602
H  4.729074 -0.511264 -2.091314
H  6.834347 0.391535 2.364721
H  7.210318 -0.493078 -1.873723
H  8.285634 -0.027949 0.352681
