program: Gaussian 09
title: 000243713
version: EM64L-G09RevD.01
frameworkgroup: C1[X(C12H20O4)]
method: RPBEPBE
basis: SDD
operation: Freq
keyword: #pfreq=noraman
keyword: PBEPBE/SDD
title: #p freq=noraman PBEPBE/SDD
converged: YES YES NO NO
title: Mulliken charges:
elementType: O O O O C C C C C C C C C C C C H H H H H H H H H H H H H H H H H H H H
charge: -0.295898 -0.295922 -0.244106 -0.244098 -0.067536 -0.067523 -0.439183 -0.439141 -0.388159 -0.388174 0.296464 0.296428 -0.492179 -0.492161 -0.661856 -0.661829 0.262224 0.262220 0.223976 0.235424 0.223965 0.235387 0.203710 0.208425 0.203703 0.208437 0.238610 0.242601 0.238609 0.242616 0.236347 0.216141 0.225010 0.236303 0.216131 0.225036
chargesum: 0.00000
title: Mulliken charges with hydrogens summed into heavy atoms:
elementType: O O O O C C C C C C C C C C C C
charge: -0.295898 -0.295922 -0.244106 -0.244098 0.194687 0.194696 0.020217 0.020211 0.023976 0.023967 0.296464 0.296428 -0.010968 -0.010936 0.015641 0.015641
polarizability: 1.71797329e+02 -3.75636683e-03 1.25693856e+02 1.86243986e+00 -2.40656946e-03 1.23924397e+02
1716.lowfreq: -10.1449 -9.9513 -6.6306 -0.0006 -0.0002 0.0001 5.1274 10.1575 36.1917
frequency: -9.6476 0.6333 36.1848 46.1993 47.8946 61.7996 83.5053 101.5823 163.1536 164.8910 189.8415 194.0198 217.3934 219.2060 268.0706 269.8918 294.0341 355.3501 362.6719 447.5632 471.8548 490.3632 544.0321 547.7561 582.7931 632.6698 635.1971 677.4541 775.7909 791.9335 793.1757 801.4661 812.8247 841.4878 852.5584 882.0328 892.7264 911.3801 934.2613 1009.4837 1015.4727 1017.6946 1053.2954 1067.9847 1074.8660 1077.1790 1083.9013 1084.5598 1086.2621 1119.9273 1122.4940 1137.3532 1154.0324 1168.1461 1244.0820 1244.1074 1244.8752 1268.8931 1282.8604 1314.3476 1326.8467 1328.1885 1337.3250 1341.0089 1346.7958 1354.6113 1368.8261 1369.8660 1398.0821 1398.1167 1444.8049 1444.9405 1454.0663 1454.2611 1466.5290 1471.5398 1472.2511 1472.3181 1482.5107 1482.5635 1645.0858 1649.9700 2983.4632 2985.8739 2992.5857 2992.6488 2996.2743 2996.7244 2999.0818 2999.1535 3040.0873 3044.1354 3048.0544 3051.7617 3051.8697 3053.7338 3060.7307 3063.4612 3095.3637 3095.4041 3104.1463 3104.1559
redmass: 2.1403 2.1031 5.6264 3.6764 6.6816 2.9315 3.4196 2.7238 2.7108 4.0389 1.1647 1.3476 5.9802 2.5807 2.6456 4.7361 4.4687 1.9332 3.7164 2.0371 3.5646 3.6303 2.7402 3.1487 4.2795 4.4671 3.4316 2.6067 1.9211 1.3784 1.3535 3.3240 3.5735 3.5039 2.9570 2.4409 2.3795 2.8782 1.9762 2.3500 1.8494 2.2053 1.6897 1.8590 2.6322 2.4982 1.7998 1.7564 1.9909 2.6149 1.1617 2.7510 1.3003 2.0239 1.1898 1.1776 1.2693 1.2100 1.2271 1.4700 1.7011 1.3981 1.7677 1.6419 1.5831 1.4582 1.4024 1.5721 1.2088 1.2086 1.0850 1.0843 1.0836 1.0868 1.0807 1.0878 1.0402 1.0433 1.0512 1.0513 9.6564 9.6695 1.0588 1.0642 1.0626 1.0626 1.0627 1.0631 1.0373 1.0372 1.0969 1.0857 1.0997 1.0958 1.0958 1.0883 1.1008 1.1024 1.1005 1.1005 1.1001 1.1001
irintensity: 0.1763 0.0407 0.4636 4.3888 0.9758 1.7815 0.1440 1.2218 0.3445 2.0802 0.2311 0.2091 0.0264 3.4975 1.1631 16.7081 11.4681 0.0022 19.3478 3.8110 0.8639 7.0451 1.1830 1.8533 1.0082 0.1162 3.6229 0.1281 5.0626 8.3929 13.7813 0.4194 21.8029 11.2544 18.6806 9.5595 8.3471 7.6304 62.7930 5.3547 4.7078 175.8639 22.5689 0.5952 224.9510 31.1370 2.0970 0.0348 4.3132 553.3580 4.9548 101.4964 2.5023 2.7606 0.1531 1.9157 0.1386 6.8360 3.7484 12.3270 4.9881 0.7464 92.2598 7.7211 6.6049 0.0733 2.1926 0.6803 24.1014 14.0205 45.1884 11.9752 0.2944 23.1697 10.5530 5.3292 13.8362 19.0323 29.0583 1.3955 247.0326 68.6697 31.2360 33.5196 15.2614 23.7970 1.6924 26.9862 36.9548 11.8707 55.0906 6.3657 46.8999 3.4769 5.9566 7.4505 0.2985 79.5641 42.7060 20.0521 21.1683 36.0752
temp: 298.150 k
press: 1.00000 atm
elementType: 8 8 8 8 6 6 6 6 6 6 6 6 6 6 6 6 1 1 1 1 1 1 1 1 1 1 1 1 1 1 1 1 1 1 1 1
symmnumber: 1
zpe: 798726.7 jmol-1
zpe.correction: 0.304219 hartree
zpe.thermalcorrener: 0.321431 hartree
zpe.thermalcorrenthalpy: 0.322376 hartree
zpe.thermalcorrgfe: 0.253672 hartree
zpe.sumelectzpe: -768.924564 hartree
zpe.sumelectthermal: -768.907351 hartree
zpe.sumelectthermalent: -768.906407 hartree
zpe.sumelectthermalfe: -768.975111 hartree
dipole: -0.0011 2.0106 0.0008
dipole: 2.0106
quadrupole: -87.7377 -96.2798 -102.0658
quadrupole: -0.0029 13.9365 -0.0004
quadrupole: 7.6234 -0.9187 -6.7047 -0.0029 13.9365 -0.0004
hfenergy: -769.2287828 hartree
pointgroup: C01 [X(C12H20O4)]
dipole: -0.0000921 -0.7910497 0.0001304 debye
polarizability: 171.4997609|0.0236111|125.6938642|4.1982193|-0.0012868|124.2219573 unknown
InChI: InChI=1S/C12H20O4/c1-3-11(13)15-9-7-5-6-8-10(9)16-12(14)4-2/h9-10H,3-8H2,1-2H3
charge 0 multiplicity 1
36 atoms
O  -1.838021 -0.050203 0.123917
O  1.838268 -0.049446 -0.123265
O  -2.717107 1.047877 -1.741028
O  2.7170 1.051392 1.740234
C  -0.512915 -0.181082 -0.573733
C  0.513352 -0.180651 0.574761
C  -0.48207 -1.470484 -1.412277
C  0.482898 -1.469645 1.413906
C  -0.556821 -2.742699 -0.536266
C  0.557899 -2.742298 0.538543
C  -2.867134 0.582946 -0.589527
C  2.867138 0.585049 0.589314
C  -4.145592 0.594201 0.234854
C  4.144998 0.597493 -0.235978
C  -5.203958 1.564657 -0.32077
C  5.202996 1.568696 0.319003
H  -0.37759 0.706548 -1.217369
H  0.37771 0.707276 1.21792
H  0.469454 -1.465796 -1.979512
H  -1.302207 -1.439011 -2.152139
H  -0.468653 -1.464906 1.981107
H  1.302991 -1.437604 2.153775
H  -0.472148 -3.64027 -1.177648
H  -1.545817 -2.791084 -0.038932
H  0.473404 -3.639529 1.180429
H  1.546913 -2.79079 0.041252
H  -4.538034 -0.442456 0.248139
H  -3.882631 0.829001 1.282219
H  4.538212 -0.438853 -0.249956
H  3.881012 0.832416 -1.283073
H  -5.428629 1.33836 -1.376721
H  -6.138173 1.489454 0.262981
H  -4.849332 2.608902 -0.274754
H  5.429079 1.342106 1.37459
H  6.136643 1.494729 -0.265817
H  4.847263 2.612602 0.273917
