program: Gaussian 09
title: 000243752
version: EM64L-G09RevD.01
frameworkgroup: C1[X(C20H27FO3)]
method: RPBEPBE
basis: SDD
operation: Freq
keyword: #p
keyword: freq=noraman
keyword: PBEPBE/SDD
title: #p freq=noraman PBEPBE/SDD
converged: YES YES NO NO
title: Mulliken charges:
elementType: F O O O C C C C C C C C C C C C C C C C C C C C H H H H H H H H H H H H H H H H H H H H H H H H H H H
charge: -0.221986 -0.435497 -0.465653 -0.253720 -0.136643 0.404007 -0.231868 0.314380 -0.233218 -0.635716 -0.593411 -0.234534 -0.037168 0.024918 -0.440158 -0.823933 -0.663675 0.635383 -0.776135 -0.769470 -0.176149 -0.653740 -0.401565 0.190541 0.259502 0.258614 0.197730 0.242562 0.212453 0.230368 0.221854 0.248302 0.246907 0.226453 0.237537 0.249025 0.233550 0.220736 0.219596 0.242522 0.218719 0.205005 0.237976 0.238566 0.218177 0.285550 0.264601 0.333461 0.353484 0.260684 0.251079
chargesum: 0.00000
title: Mulliken charges with hydrogens summed into heavy atoms:
elementType: F O O O C C C C C C C C C C C C C C C C C C C C
charge: -0.221986 -0.102037 -0.112169 -0.253720 0.122859 0.404007 0.026745 0.314380 -0.035489 -0.180701 -0.141188 0.013767 0.209739 0.024918 0.023832 -0.120622 -0.201557 0.635383 -0.114435 -0.027178 0.088452 -0.393057 -0.150486 0.190541
polarizability: 2.78443515e+02 5.83667991e+00 2.01877455e+02 -2.30441450e+01 1.99035284e+00 1.73545928e+02
1716.lowfreq: 0.0006 0.0007 0.0009 4.4180 9.2563 13.6467 33.7798 54.2409 72.3168
frequency: 33.6786 54.1789 72.2936 74.1960 111.3975 122.3867 155.1278 181.2391 184.6996 194.0128 207.0638 209.1541 227.5894 228.3532 243.4716 247.1488 251.6708 263.2796 265.1042 279.7079 287.0731 303.9596 313.7418 321.5607 361.1288 362.2558 369.6467 379.1364 413.6797 432.6518 460.3260 469.4018 482.4096 501.4599 513.5973 522.2794 538.4290 563.5308 579.5090 613.0350 655.7917 658.9717 682.6560 697.4518 738.9377 763.7649 809.1179 823.4170 830.0460 848.2958 860.6792 868.1874 885.4788 903.0004 914.4228 922.2491 929.3374 934.8625 951.8849 958.7913 978.3238 994.9100 1002.2445 1009.3765 1023.5115 1027.9496 1035.7016 1051.5594 1065.2722 1078.0573 1093.2745 1097.5345 1104.2148 1117.8799 1131.3016 1136.5142 1143.0760 1156.2998 1162.2293 1175.8339 1188.5940 1202.3231 1211.1553 1223.5505 1229.8666 1243.0440 1261.1658 1270.1983 1276.3804 1286.5494 1290.2870 1294.2248 1299.7382 1313.1006 1322.9125 1326.6824 1344.5876 1346.0393 1351.7962 1352.8282 1367.9709 1374.5302 1378.4473 1381.1917 1388.1681 1389.7629 1399.8128 1461.6855 1464.2414 1466.2992 1468.8904 1472.7100 1474.3886 1479.9782 1484.5367 1491.8499 1498.6475 1557.4285 1618.9081 1667.3024 2914.4199 2942.4828 2943.0732 2965.9971 2969.4648 2972.3187 2987.6177 2992.8238 2996.0655 2999.4954 3002.6755 3004.7515 3018.5398 3045.3852 3051.0532 3060.1136 3064.2848 3075.3278 3078.4130 3093.1376 3104.2525 3109.5561 3129.1628 3129.7291 3149.9725 3562.0557 3571.5010
redmass: 6.0654 4.7047 3.9359 3.2000 3.3341 2.2144 2.8897 5.0504 3.4769 2.1747 1.7743 3.5387 1.5683 2.5377 1.7409 2.8146 1.6042 1.8154 2.5113 2.6423 1.3950 3.4965 2.7881 2.8262 3.2619 4.0900 3.0881 2.6501 3.3258 4.5994 2.5900 3.7386 3.5759 3.8261 3.1633 3.4317 3.8663 3.2262 4.3073 4.0903 3.2230 4.0458 3.4061 3.6442 3.4016 3.8574 2.2457 2.1419 1.6827 2.8561 2.7174 2.8861 2.5641 1.7425 2.0010 1.6989 1.9333 1.9636 1.7038 2.4351 2.1779 2.4385 1.3362 2.5789 2.3788 2.3967 2.0144 2.8899 2.2644 1.7227 2.7932 2.0510 2.0505 1.8597 2.1162 1.7311 1.9944 2.2504 1.7340 1.8279 1.5952 1.5191 1.3926 1.5988 1.4947 1.4371 1.4602 1.4395 1.4695 1.5886 1.8129 1.5806 1.3707 1.6962 1.4321 1.3352 1.4774 1.7256 1.3590 1.4421 1.4997 2.0006 1.3733 1.4001 1.4147 1.3054 1.2152 1.0761 1.0887 1.0744 1.0868 1.0586 1.0618 1.0455 1.0698 1.0590 1.0560 8.6658 8.5523 7.4250 1.0841 1.0654 1.0810 1.0652 1.0367 1.0848 1.0641 1.0388 1.0625 1.0579 1.0566 1.0804 1.0940 1.0946 1.1023 1.1031 1.0987 1.0995 1.0964 1.0994 1.0994 1.0868 1.0927 1.0989 1.0980 1.0663 1.0659
irintensity: 2.7542 1.0108 0.7111 0.2745 0.7692 5.7080 0.8109 2.7576 5.8378 4.0047 9.7658 2.6680 3.0485 4.9076 9.7306 79.0139 48.1370 92.8212 1.0226 17.1543 51.0707 8.8979 2.3693 2.5834 0.7748 5.6876 5.2088 0.1518 0.8479 8.1503 2.3196 3.0974 4.2763 15.5426 6.1686 2.7697 3.8918 3.4979 4.8287 1.8483 0.2965 3.1766 9.7072 6.4259 1.6253 1.1039 0.3279 16.7671 9.1770 28.0283 3.5027 13.1458 17.4582 41.6353 6.2694 1.1915 3.9410 11.1149 4.8862 25.0751 33.0038 38.2585 1.5938 118.7216 0.7319 7.9363 13.7553 29.9820 11.0177 2.5751 3.6355 4.2035 5.0120 7.3008 7.8383 27.9668 17.7244 2.8846 5.5972 6.7819 10.5170 17.8458 6.0320 3.7803 7.7774 12.9622 11.6383 4.2126 5.3386 10.2907 36.6952 1.2897 10.6592 1.4177 0.0914 3.1954 2.0715 4.2709 4.0465 4.1309 8.2458 18.1295 3.4081 2.3724 28.8175 3.4495 25.7787 11.4094 4.5448 13.7565 8.5597 21.0582 6.0012 13.5265 0.7198 4.5652 7.6484 192.2878 15.2017 138.1301 30.3032 41.9572 15.6108 20.9944 36.6734 44.1489 23.3557 15.9349 22.9036 11.7998 29.0361 17.7085 22.6600 26.5105 33.5612 23.2399 57.9275 29.7671 24.0481 31.8595 15.3192 5.2391 7.1756 5.8671 13.7940 6.2110 6.3508
temp: 298.150 k
press: 1.00000 atm
elementType: 9 8 8 8 6 6 6 6 6 6 6 6 6 6 6 6 6 6 6 6 6 6 6 6 1 1 1 1 1 1 1 1 1 1 1 1 1 1 1 1 1 1 1 1 1 1 1 1 1 1 1
symmnumber: 1
zpe: 1127315.4 jmol-1
zpe.correction: 0.429372 hartree
zpe.thermalcorrener: 0.452329 hartree
zpe.thermalcorrenthalpy: 0.453273 hartree
zpe.thermalcorrgfe: 0.380106 hartree
zpe.sumelectzpe: -1101.981777 hartree
zpe.sumelectthermal: -1101.958820 hartree
zpe.sumelectthermalent: -1101.957876 hartree
zpe.sumelectthermalfe: -1102.031044 hartree
dipole: -5.6278 -2.0917 2.1496
dipole: 6.3772
quadrupole: -191.0083 -127.6488 -145.2315
quadrupole: -3.2272 17.5175 8.4913
quadrupole: -36.3787 26.9807 9.3981 -3.2272 17.5175 8.4913
hfenergy: -1102.4111491 hartree
pointgroup: C01 [X(C20H27F1O3)]
dipole: -2.238984 0.8119702 -0.7890304 debye
polarizability: 279.1980473|-5.2088949|201.4870517|21.4815026|3.4580899|173.1817992 unknown
InChI: InChI=1S/C20H27FO3/c1-11-8-15-14-5-4-12-9-13(22)6-7-19(12,3)20(14,21)16(23)10-18(15,2)17(11)24/h6-7,9,11,14-17,23-24H,4-5,8,10H2,1-3H3
charge 0 multiplicity 1
51 atoms
F  0.732322 -0.209775 1.406791
O  -4.931302 1.154574 0.725264
O  -0.048037 2.642667 -0.754029
O  5.658206 -0.523502 1.336015
C  -1.768908 -0.692645 -0.005813
C  -2.48176 0.688639 0.087518
C  -0.394253 -0.634713 -0.701932
C  0.522559 0.378503 0.042194
C  -3.79991 0.219361 0.783263
C  -1.58795 1.60846 0.947622
C  -2.860595 -1.648675 -0.557771
C  -0.135354 1.744485 0.417361
C  -4.204071 -1.085349 0.033147
C  1.978787 0.460573 -0.578839
C  0.265896 -2.037646 -0.734882
C  -2.811056 1.321373 -1.288053
C  1.729219 -2.02027 -1.251404
C  2.555492 -0.95989 -0.552069
C  -4.966986 -2.076475 0.932499
C  1.962941 0.956178 -2.073126
C  2.82922 1.460117 0.184535
C  3.743637 -1.24556 0.060669
C  4.012556 1.150572 0.781696
C  4.551772 -0.231677 0.770249
H  -1.563919 -1.007842 1.041358
H  -0.522565 -0.26837 -1.739553
H  -3.564649 -0.017724 1.847979
H  -1.525915 1.19563 1.974567
H  -2.01636 2.631088 1.040172
H  -2.876428 -1.640918 -1.66437
H  -2.689827 -2.693362 -0.241808
H  0.484263 2.169586 1.233895
H  -4.876528 -0.773049 -0.788884
H  -0.342149 -2.706174 -1.372095
H  0.251619 -2.45425 0.289915
H  -1.897852 1.582292 -1.846042
H  -3.423624 0.646888 -1.910205
H  -3.407119 2.240927 -1.142275
H  1.721112 -1.826478 -2.344045
H  2.190874 -3.013832 -1.109177
H  -5.320756 -2.951016 0.355929
H  -4.321516 -2.451454 1.750533
H  -5.848758 -1.588522 1.386506
H  2.999578 0.958091 -2.452591
H  1.362697 0.297314 -2.722421
H  1.546142 1.971593 -2.131261
H  2.467753 2.496866 0.167097
H  -4.791659 1.879101 1.385556
H  -0.671402 3.398484 -0.61267
H  4.1487 -2.265258 0.057502
H  4.622462 1.908162 1.287482
