program: Gaussian 09
title: 000243677
version: EM64L-G09RevD.01
frameworkgroup: C1[X(C13H24O4)]
method: RPBEPBE
basis: SDD
operation: Freq
keyword: #pfreq=noraman
keyword: PBEPBE/SDD
title: #p freq=noraman PBEPBE/SDD
converged: YES YES NO NO
title: Mulliken charges:
elementType: O O O O C C C C C C C C C C C C C H H H H H H H H H H H H H H H H H H H H H H H H
charge: -0.257145 -0.257144 -0.250132 -0.250132 -0.382438 -0.380598 -0.380597 -0.380483 -0.380483 -0.393780 -0.393780 -0.281837 -0.281836 0.286179 0.286179 -0.751430 -0.751430 0.195465 0.195448 0.196544 0.196567 0.196564 0.196547 0.196032 0.196010 0.196019 0.196023 0.212737 0.212714 0.212728 0.212723 0.227829 0.227861 0.227827 0.227863 0.246950 0.246933 0.244810 0.246954 0.246929 0.244810
chargesum: 0.00000
title: Mulliken charges with hydrogens summed into heavy atoms:
elementType: O O O O C C C C C C C C C C C C C
charge: -0.257145 -0.257144 -0.250132 -0.250132 0.008475 0.012513 0.012513 0.011559 0.011559 0.031671 0.031671 0.173854 0.173854 0.286179 0.286179 -0.012736 -0.012736
polarizability: 2.19512610e+02 -3.40332963e-05 1.40991127e+02 -1.69869772e-02 -2.24919115e-03 1.12625421e+02
1716.lowfreq: -31.3323 -31.3204 -2.0139 -0.0015 -0.0005 0.0008 5.0444 12.7739 19.9603
frequency: -31.3123 -30.4533 12.7775 21.0696 21.6337 31.5641 49.9703 59.5101 74.0481 80.4756 111.5992 111.6785 117.7087 133.8311 147.9812 152.2788 178.3234 189.9888 191.1827 251.0143 265.2217 333.0732 373.5616 421.2122 442.0947 492.1041 492.3108 565.8412 565.8474 614.0320 614.2122 725.3979 732.3332 748.4604 774.8324 818.1347 830.7743 832.0471 881.1348 934.3730 935.9426 953.0678 995.8912 997.4750 1002.4766 1007.7462 1017.6415 1041.1519 1041.1588 1049.6546 1054.2508 1079.0573 1081.9487 1091.5997 1115.3838 1147.9120 1154.0644 1200.5423 1205.2179 1206.6683 1212.5870 1231.7557 1249.8579 1260.2457 1274.1829 1282.4617 1284.7074 1287.9684 1300.2829 1301.5324 1314.3885 1342.2586 1358.3516 1359.2736 1371.7755 1372.0300 1381.8972 1381.9449 1453.3091 1453.3315 1454.6179 1454.6208 1462.8340 1463.7492 1468.2163 1468.3715 1471.1907 1476.6736 1482.9601 1489.2902 1492.0322 1649.7207 1650.0107 2954.3578 2955.2191 2957.8571 2962.8532 2968.7710 2988.7229 2990.3809 2990.5451 2995.7502 3000.3207 3000.4146 3006.2076 3007.6444 3007.6472 3022.2080 3036.8435 3045.2429 3048.4293 3074.6370 3074.9529 3095.9050 3095.9109 3143.0545 3143.0672
redmass: 1.0564 1.0792 4.5011 7.3862 4.9146 3.1587 3.7212 4.5384 2.0346 2.4284 5.2194 2.0060 2.0532 5.7487 2.1717 1.9781 4.6183 2.8353 2.6578 3.9938 4.6913 3.5096 3.7736 3.3412 3.5599 3.3541 3.1931 2.9913 2.9895 4.8812 4.8682 1.0617 1.0758 1.0938 1.1349 1.1976 6.1739 6.2294 1.2368 5.3338 4.8785 1.2186 2.5846 4.6840 2.2076 3.4972 1.1251 1.6698 1.6696 3.5634 3.6508 2.4333 2.1093 2.7032 3.9863 1.5070 1.3186 1.4931 3.5591 3.5820 1.2556 1.3423 1.2938 1.2384 1.1056 1.3011 1.0997 1.0698 1.1144 1.0990 1.3289 1.3843 1.4977 1.6852 1.4696 1.4426 1.3280 1.3325 1.0635 1.0635 1.0472 1.0472 1.0718 1.0756 1.0671 1.0791 1.0884 1.0904 1.0929 1.0962 1.0990 9.1997 9.2086 1.0588 1.0586 1.0592 1.0594 1.0588 1.0967 1.0598 1.0598 1.0989 1.0566 1.0566 1.1018 1.0366 1.0366 1.1039 1.1041 1.1045 1.1049 1.1078 1.1077 1.0974 1.0974 1.1010 1.1010
irintensity: 0.0000 1.5145 0.4669 0.0001 0.1200 0.0000 0.5449 1.4623 1.5792 0.0000 0.1519 0.0008 0.1091 0.0858 2.4441 0.0000 8.3035 0.0000 13.1809 1.9116 6.9371 9.6242 1.1458 0.3037 7.5179 0.0063 4.1439 0.0002 5.3915 5.3388 4.5466 14.7551 0.0000 4.9866 0.0000 0.1106 18.9911 18.6016 0.0000 67.2580 1.9520 0.1277 63.7535 0.3057 1.0145 183.3862 0.0000 19.0276 0.0048 10.8148 0.0000 0.0432 0.2935 42.0346 0.5490 2.3065 0.0000 0.3693 781.9372 4.4293 9.0358 0.0000 0.1769 0.2809 0.0000 8.1244 0.9844 0.0000 0.0000 0.0159 0.1819 0.0121 0.0151 0.0804 6.7250 26.5463 34.1322 43.8062 7.9921 49.0222 1.1184 34.8682 0.0661 0.0012 0.2598 0.3629 0.0259 1.4306 1.0444 1.4122 37.3337 74.4027 328.9857 0.0138 0.0060 0.9318 0.0039 136.6545 0.2950 0.4512 30.8716 0.0000 3.3716 84.9482 2.7380 3.1339 6.1757 0.0000 40.5134 0.0000 84.9704 0.0092 172.2741 6.1832 12.5551 16.6645 6.6505
temp: 298.150 k
press: 1.00000 atm
elementType: 8 8 8 8 6 6 6 6 6 6 6 6 6 6 6 6 6 1 1 1 1 1 1 1 1 1 1 1 1 1 1 1 1 1 1 1 1 1 1 1 1
symmnumber: 1
zpe: 922906.1 jmol-1
zpe.correction: 0.351516 hartree
zpe.thermalcorrener: 0.371889 hartree
zpe.thermalcorrenthalpy: 0.372833 hartree
zpe.thermalcorrgfe: 0.296971 hartree
zpe.sumelectzpe: -809.309731 hartree
zpe.sumelectthermal: -809.289359 hartree
zpe.sumelectthermalent: -809.288415 hartree
zpe.sumelectthermalfe: -809.364277 hartree
dipole: 0.0000 -3.4335 0.0012
dipole: 3.4335
quadrupole: -126.9726 -112.7682 -100.9336
quadrupole: 0.0000 0.0307 0.0101
quadrupole: -13.4145 0.7900 12.6245 0.0000 0.0307 0.0101
hfenergy: -809.6612479 hartree
pointgroup: C01 [X(C13H24O4)]
dipole: -0.0000386 1.3508244 -0.001315 debye
polarizability: 219.5124846|0.002425|140.9910825|0.1167969|-0.0356391|112.6255908 unknown
InChI: InChI=1S/C13H24O4/c1-12(14)16-10-8-6-4-3-5-7-9-11-17-13(2)15/h3-11H2,1-2H3
charge 0 multiplicity 1
41 atoms
O  -6.294923 0.524577 -0.006634
O  6.296944 0.524962 0.00347
O  -7.713706 -1.32545 -0.0087
O  7.715838 -1.324976 0.008228
C  0.001037 -0.394206 0.000814
C  -1.288729 0.456589 -0.000852
C  1.290751 0.456668 0.000965
C  -2.577927 -0.39548 -0.001072
C  2.580001 -0.395321 0.002428
C  -3.863005 0.465366 -0.003341
C  3.865028 0.465603 0.002355
C  -5.122141 -0.401283 -0.003546
C  5.124215 -0.400969 0.003975
C  -7.556302 -0.083376 -0.00888
C  7.558361 -0.082914 0.005487
C  -8.64819 0.965381 -0.01237
C  8.650191 0.965909 0.004852
H  0.000439 -1.05951 0.889415
H  0.001674 -1.061038 -0.886641
H  -1.288871 1.121511 -0.889499
H  -1.290161 1.123065 0.886627
H  1.29095 1.123061 0.888507
H  1.292047 1.121674 -0.887619
H  -2.576323 -1.059986 0.88789
H  -2.574649 -1.062015 -0.88851
H  2.578082 -1.061624 -0.885188
H  2.577116 -1.060061 0.891212
H  -3.875546 1.12572 0.88512
H  -3.873837 1.123499 -0.893474
H  3.877202 1.123967 -0.887589
H  3.876148 1.125729 0.891006
H  -5.186738 -1.046874 0.892212
H  -5.184363 -1.04989 -0.897283
H  5.188107 -1.049078 -0.890013
H  5.187216 -1.047053 0.899485
H  -8.549106 1.613932 -0.89993
H  -8.556686 1.611662 0.877692
H  -9.632126 0.475254 -0.017035
H  8.552464 1.616516 0.891059
H  8.557251 1.610113 -0.886562
H  9.634163 0.475848 0.009132
