program: Gaussian 09
title: 000243678
version: EM64L-G09RevD.01
frameworkgroup: C1[X(C14H20O2)]
method: RPBEPBE
basis: SDD
operation: Freq
keyword: #pfreq=noraman
keyword: PBEPBE/SDD
title: #p freq=noraman PBEPBE/SDD
converged: YES YES NO NO
title: Mulliken charges:
elementType: O O C C C C C C C C C C C C C C H H H H H H H H H H H H H H H H H H H H
charge: -0.308566 -0.263853 -0.415042 -0.363217 0.049829 -0.347076 -0.358375 -0.720526 -0.695909 0.204810 0.212668 -0.343218 -0.343125 -0.221349 -0.219401 -0.223402 0.191559 0.207779 0.188656 0.215284 0.231731 0.184310 0.188238 0.196256 0.197389 0.214461 0.220580 0.250254 0.209386 0.209502 0.216429 0.270586 0.268801 0.232749 0.230156 0.231646
chargesum: 0.00000
title: Mulliken charges with hydrogens summed into heavy atoms:
elementType: O O C C C C C C C C C C C C C C
charge: -0.308566 -0.263853 -0.015704 0.040723 0.281560 0.025472 0.035270 -0.035231 -0.060592 0.204810 0.212668 -0.072632 -0.074324 0.011400 0.010755 0.008244
polarizability: 1.86458604e+02 -2.54836158e+01 1.57636910e+02 -1.44633259e+01 -1.64133166e+01 1.28436044e+02
1716.lowfreq: -23.5511 -18.0277 -5.2083 -0.0002 0.0004 0.0005 12.8683 19.5133 22.7128
frequency: -13.2180 18.0979 22.2768 57.8955 68.5266 94.0764 98.8197 118.2793 130.3447 170.5879 194.1643 211.0801 233.0874 251.9818 277.8627 300.7767 365.5801 404.2136 409.4141 445.5233 454.0478 483.5299 502.1702 613.6766 658.9347 680.2213 702.1584 720.4840 738.4007 783.0324 795.5321 813.4807 841.1763 865.4941 884.1085 918.5449 940.6869 954.3893 990.2292 993.7375 996.3029 1007.1258 1008.2771 1019.7123 1056.4999 1056.8590 1064.2360 1080.4447 1087.2215 1121.3095 1130.5552 1167.2079 1173.4709 1181.4693 1203.7936 1234.2810 1243.3248 1260.9744 1283.5745 1289.0200 1291.7174 1314.5211 1327.4384 1333.4004 1350.8883 1361.2370 1387.7219 1389.1783 1389.5433 1437.1452 1447.8027 1462.7636 1465.0753 1468.3481 1476.9576 1477.7085 1477.9917 1479.0141 1486.4940 1582.5549 1610.4562 1615.6080 2950.0919 2962.3613 2968.3171 2971.4942 2974.4297 2989.5759 2990.8160 3010.3760 3017.8678 3028.5779 3048.3371 3067.6814 3071.2215 3085.9545 3101.0047 3128.8416 3141.4994 3154.4926 3166.5422 3177.7738
redmass: 1.6450 4.1354 3.7860 5.1457 3.3099 3.5193 3.6665 1.8418 2.8218 4.0925 2.8278 1.1364 1.1116 4.1529 3.9687 3.6188 3.9181 2.8344 3.7670 3.6043 3.0735 4.0013 3.0546 6.4432 6.7139 5.0663 1.5947 1.0949 1.3260 2.1684 2.2005 6.3204 1.3903 1.2442 2.0429 1.6226 1.2910 1.4216 5.6322 2.6905 1.3879 1.7449 1.3266 2.8249 2.5763 2.7883 2.0909 2.0099 1.8096 1.8404 2.4911 2.0845 1.0561 1.1358 1.5325 1.4939 2.2680 1.3086 1.0643 1.3026 1.1292 1.3241 1.4384 1.3115 1.6247 1.7086 1.2385 9.1715 1.2191 2.2367 1.0812 1.0673 1.0573 1.0757 1.9670 1.0432 1.1276 1.0740 1.0840 7.1035 6.3795 9.0715 1.0588 1.0611 1.0588 1.0374 1.0599 1.0368 1.0961 1.0934 1.0947 1.0993 1.1030 1.1007 1.0992 1.0987 1.1006 1.0854 1.0892 1.0939 1.0977 1.0978
irintensity: 0.1122 0.2001 0.3980 2.2765 0.0371 1.0614 0.0846 0.0234 0.9780 0.1952 1.0528 0.6559 0.0168 4.5925 3.7862 0.4851 3.1144 0.0023 3.0956 0.5722 8.1582 0.7828 0.3356 0.5412 4.2354 14.0438 94.0744 9.4238 2.1420 3.0379 21.7183 12.9425 8.4604 0.1095 9.9210 4.5501 0.7239 4.2062 5.2242 17.3248 0.0035 9.1583 0.4274 78.7009 139.1769 106.1664 4.1398 18.2659 31.2318 21.6461 12.5985 27.3299 0.0487 35.3335 6.8309 70.9797 247.6228 19.8373 1.1390 3.0029 2.9137 3.1418 4.3343 7.3388 0.3218 5.2984 21.4226 2.7349 12.7542 14.9095 2.3689 0.1241 10.3986 1.0416 12.3832 12.2385 4.9814 5.4572 18.5863 53.9378 15.5098 131.5543 10.6038 1.1084 53.8271 30.9377 71.5532 28.6096 5.8581 1.1975 13.1032 5.3405 73.9376 95.5089 51.9159 44.6339 19.9840 0.2176 12.1543 16.6621 21.9502 8.4608
temp: 298.150 k
press: 1.00000 atm
elementType: 8 8 6 6 6 6 6 6 6 6 6 6 6 6 6 6 1 1 1 1 1 1 1 1 1 1 1 1 1 1 1 1 1 1 1 1
symmnumber: 1
zpe: 804567.0 jmol-1
zpe.correction: 0.306443 hartree
zpe.thermalcorrener: 0.323046 hartree
zpe.thermalcorrenthalpy: 0.323990 hartree
zpe.thermalcorrgfe: 0.259790 hartree
zpe.sumelectzpe: -694.727628 hartree
zpe.sumelectthermal: -694.711025 hartree
zpe.sumelectthermalent: -694.710081 hartree
zpe.sumelectthermalfe: -694.774281 hartree
dipole: -0.6875 -1.1694 1.5607
dipole: 2.0678
quadrupole: -88.4839 -94.6501 -98.3329
quadrupole: -10.5097 0.7854 0.8980
quadrupole: 5.3384 -0.8278 -4.5106 -10.5097 0.7854 0.8980
hfenergy: -695.034071 hartree
pointgroup: C01 [X(C14H20O2)]
dipole: 0.2647912 0.5081846 0.5774897 debye
polarizability: 184.804112|-24.8337512|161.0985138|18.3269641|12.7015659|126.6289318 unknown
InChI: InChI=1S/C14H20O2/c1-3-4-6-9-12(2)16-14(15)13-10-7-5-8-11-13/h5,7-8,10-12H,3-4,6,9H2,1-2H3
charge 0 multiplicity 1
36 atoms
O  -0.069334 -0.915861 0.482253
O  -1.31545 -1.917487 -1.221056
C  2.293007 -1.357149 0.802589
C  2.786484 -0.25958 -0.1642
C  0.968916 -2.006177 0.374049
C  4.096545 0.412555 0.304457
C  4.601031 1.502616 -0.667816
C  0.528964 -3.184258 1.25275
C  5.902132 2.182111 -0.188441
C  -1.17011 -0.999972 -0.372216
C  -2.131838 0.12329 -0.159898
C  -3.276845 0.185197 -0.996032
C  -1.932033 1.110082 0.840409
C  -4.213519 1.226469 -0.834939
C  -2.87331 2.149284 0.999367
C  -4.0137 2.210256 0.163243
H  3.054212 -2.16051 0.876935
H  2.170719 -0.938071 1.821351
H  2.939523 -0.699415 -1.171979
H  1.995379 0.508146 -0.272704
H  0.999865 -2.314673 -0.688644
H  4.886067 -0.358471 0.43014
H  3.939912 0.862258 1.307519
H  4.764153 1.051463 -1.667829
H  3.808776 2.267736 -0.798635
H  1.273414 -3.999248 1.190695
H  0.440969 -2.873262 2.3089
H  -0.44229 -3.582754 0.914502
H  6.719038 1.443482 -0.080591
H  5.75653 2.665687 0.796159
H  6.240566 2.958387 -0.899143
H  -3.409353 -0.588439 -1.759647
H  -1.046355 1.050177 1.478849
H  -5.096027 1.273256 -1.482079
H  -2.720173 2.910577 1.772118
H  -4.742364 3.019102 0.289166
