program: Gaussian 09
title: 000243688
version: EM64L-G09RevD.01
frameworkgroup: C1[X(C15H28O4)]
method: RPBEPBE
basis: SDD
operation: Freq
keyword: #pfreq=noraman
keyword: PBEPBE/SDD
title: #p freq=noraman PBEPBE/SDD
converged: YES YES NO NO
title: Mulliken charges:
elementType: O O O O C C C C C C C C C C C C C C C H H H H H H H H H H H H H H H H H H H H H H H H H H H H
charge: -0.261646 -0.261156 -0.240920 -0.242098 -0.365588 -0.374719 -0.377059 -0.319261 -0.320235 -0.347306 -0.348628 -0.510461 -0.508960 -0.341869 -0.343032 0.246102 0.246718 -0.691807 -0.691075 0.187496 0.208264 0.237488 0.208758 0.208920 0.236793 0.231361 0.222079 0.231045 0.223960 0.200233 0.223147 0.200547 0.224811 0.242872 0.234609 0.243763 0.230834 0.194045 0.192607 0.194337 0.192928 0.213792 0.216272 0.210972 0.213749 0.216352 0.210966
chargesum: 0.00000
title: Mulliken charges with hydrogens summed into heavy atoms:
elementType: O O O O C C C C C C C C C C C C C C C
charge: -0.261646 -0.261156 -0.240920 -0.242098 0.030171 0.071527 0.068653 0.134180 0.134771 0.076074 0.076730 -0.032980 -0.034363 0.044783 0.044234 0.246102 0.246718 -0.050772 -0.050008
polarizability: 2.20098780e+02 -1.82899802e+00 1.69308947e+02 -1.71714571e+00 5.63568689e+00 1.46712103e+02
1716.lowfreq: -19.0584 -7.7784 -3.6559 -0.5298 -0.0010 -0.0005 0.0013 9.5340 18.0521
frequency: -16.7429 9.4466 17.4154 18.9957 30.9120 37.7523 51.3806 62.8806 71.8019 78.9101 95.4444 102.5142 109.8937 115.8594 121.1109 123.1722 145.4976 204.8001 228.1196 232.0603 258.2198 260.0034 275.0045 283.3734 308.6834 324.2320 368.1084 419.0261 440.8672 475.1711 520.2200 578.5639 592.3767 661.3258 664.3123 727.7016 728.4441 745.8585 771.7111 787.9523 790.5160 812.4022 827.8207 855.4480 902.9921 903.7196 920.3637 920.8775 933.4623 937.3474 971.0802 1020.3093 1031.0267 1034.9216 1038.0538 1074.0250 1078.0051 1079.1979 1086.2737 1089.3515 1097.0558 1107.6205 1108.0000 1141.1831 1146.0707 1158.7998 1190.3125 1207.6048 1208.1065 1239.3562 1252.1406 1257.1141 1259.7751 1275.2606 1277.1693 1284.2130 1288.5386 1290.4219 1294.4204 1294.8672 1305.6689 1328.9262 1332.8682 1353.5786 1356.1921 1360.2887 1371.2835 1376.5491 1390.2592 1390.8578 1442.2748 1443.4985 1452.2584 1453.7038 1467.9199 1468.5100 1470.3897 1474.6512 1476.1931 1477.0727 1477.2452 1477.5794 1487.8819 1488.1617 1488.7676 1640.4995 1642.3390 2960.1141 2962.5650 2963.5421 2974.1132 2974.9553 2976.0070 2977.0849 2989.5295 2989.7872 2991.0006 2994.3662 3007.0830 3008.1723 3008.4839 3018.3594 3019.2070 3042.0215 3044.1302 3048.3096 3059.2496 3064.4085 3067.3939 3072.7467 3074.1642 3074.2412 3075.0476 3097.5347 3099.2601
redmass: 2.8300 3.3744 5.3374 4.8476 2.4312 2.9542 2.7455 2.6812 2.6684 2.6164 2.8624 2.4666 2.0811 2.6257 3.4461 2.0853 3.3996 4.7164 1.1302 1.1445 2.9893 2.8978 3.9171 3.9590 4.8195 3.9854 3.6034 3.0708 3.2857 3.4059 3.8649 3.2524 3.6416 4.1144 4.0573 1.1060 1.1038 1.0709 1.1911 1.2830 1.2983 2.7005 4.3760 1.6408 1.7808 1.7930 1.3554 1.3216 4.2047 5.9602 1.3179 4.7009 3.6489 3.7141 4.1216 2.3685 2.0168 1.9848 2.7472 2.3940 2.8345 2.1475 2.0319 2.5740 2.6068 1.8837 1.3665 1.4394 1.4439 1.2389 1.2714 1.3462 1.3571 1.2082 1.2113 1.0572 1.0737 1.0671 1.1398 1.1374 1.2538 1.4929 1.5203 1.4483 1.5950 1.6565 1.4477 1.3889 1.2158 1.2201 1.0871 1.0868 1.0921 1.0942 1.0668 1.0663 1.0663 1.0911 1.0637 1.0616 1.0458 1.0448 1.0826 1.0999 1.0847 9.2155 9.2217 1.0592 1.0591 1.0589 1.0385 1.0372 1.0632 1.0640 1.0621 1.0617 1.0596 1.0622 1.0986 1.0986 1.0964 1.0576 1.0575 1.0974 1.0983 1.1028 1.1039 1.0991 1.0988 1.1001 1.1000 1.0999 1.1000 1.1087 1.1082
irintensity: 0.0232 0.1793 0.6804 1.0414 0.3758 1.1169 0.1123 0.5612 0.5172 1.0134 0.5071 0.7713 0.2854 1.2874 1.4077 0.3808 1.9393 2.9894 0.0406 0.0938 4.8260 3.2309 1.4724 6.1491 8.3066 23.6998 6.7870 0.7075 5.0052 2.7404 1.6534 2.7645 8.4930 7.0900 5.3598 13.5732 12.8694 10.0391 1.7592 0.4682 0.5512 10.3420 1.6060 2.9194 15.1970 9.0313 10.0031 3.4195 59.7572 22.4592 3.5166 9.3925 7.3013 52.8462 17.4058 6.6809 25.6829 23.2099 95.2549 115.8092 15.8310 2.6552 1.8631 267.4999 172.4446 16.4618 8.1695 8.1441 6.6705 17.6721 1.1589 48.2133 43.7279 10.4853 10.9464 0.0586 0.5996 0.6923 2.3872 2.3365 0.5811 42.5919 38.0021 0.4075 6.2687 5.7083 1.0885 1.1355 14.3766 14.8110 20.4975 18.3163 6.0505 12.8443 0.8746 1.0197 0.4380 0.0633 4.7214 3.6290 11.4138 11.8768 20.5827 20.9977 22.0818 43.7338 238.4896 25.3113 31.8973 30.9142 33.4027 34.1054 0.4940 0.3669 43.4837 44.3953 0.4461 25.7320 11.9468 11.0650 12.1512 3.1754 94.0682 3.5834 5.9748 0.3745 29.2404 1.8759 0.8201 80.8809 72.1988 72.3166 87.0019 3.2484 56.9737
temp: 298.150 k
press: 1.00000 atm
elementType: 8 8 8 8 6 6 6 6 6 6 6 6 6 6 6 6 6 6 6 1 1 1 1 1 1 1 1 1 1 1 1 1 1 1 1 1 1 1 1 1 1 1 1 1 1 1 1
symmnumber: 1
zpe: 1072228.7 jmol-1
zpe.correction: 0.408390 hartree
zpe.thermalcorrener: 0.431868 hartree
zpe.thermalcorrenthalpy: 0.432813 hartree
zpe.thermalcorrgfe: 0.348923 hartree
zpe.sumelectzpe: -887.756284 hartree
zpe.sumelectthermal: -887.732805 hartree
zpe.sumelectthermalent: -887.731861 hartree
zpe.sumelectthermalfe: -887.815750 hartree
dipole: 0.1604 -1.3955 -2.6721
dipole: 3.0188
quadrupole: -104.3896 -111.5289 -124.3944
quadrupole: -1.0005 0.8923 -4.7558
quadrupole: 9.0481 1.9087 -10.9568 -1.0005 0.8923 -4.7558
hfenergy: -888.1646739 hartree
pointgroup: C01 [X(C15H28O4)]
dipole: -0.0572059 -0.3510519 -1.133191 debye
polarizability: 220.0346454|-0.8962674|152.4538444|2.8853417|-11.3721341|163.6313398 unknown
InChI: InChI=1S/C15H28O4/c1-3-5-10-14(16)18-12-8-7-9-13-19-15(17)11-6-4-2/h3-13H2,1-2H3
charge 0 multiplicity 1
47 atoms
O  -3.859452 1.058821 -1.469265
O  3.669242 0.46067 -1.49002
O  -3.886077 1.126076 0.8644
O  3.732192 0.763648 0.823824
C  -0.02963 1.603643 -1.493163
C  -1.376166 0.85401 -1.365584
C  1.181743 0.648857 -1.375908
C  -2.569909 1.813083 -1.470605
C  2.507629 1.397251 -1.569084
C  -6.100463 -0.824541 0.848612
C  6.357818 -0.588146 0.850788
C  -5.741944 0.047517 -0.373635
C  5.312601 -0.799275 -0.266738
C  -7.511485 -1.442441 0.73162
C  7.412584 -1.716272 0.892459
C  -4.42002 0.780067 -0.214638
C  4.180241 0.212144 -0.208056
C  -7.870036 -2.33493 1.939069
C  8.470609 -1.494265 1.994465
H  0.007552 2.133833 -2.468105
H  0.038523 2.381298 -0.705115
H  -1.420368 0.327418 -0.393881
H  -1.455141 0.08936 -2.162636
H  1.101479 -0.154302 -2.133822
H  1.179012 0.168208 -0.379604
H  -2.575721 2.531529 -0.630724
H  -2.578536 2.349964 -2.434164
H  2.633364 2.182942 -0.801875
H  2.587906 1.83231 -2.579313
H  -5.35026 -1.632591 0.959291
H  -6.030384 -0.209389 1.765429
H  6.863981 0.386495 0.702576
H  5.835421 -0.52177 1.82378
H  -5.711171 -0.545206 -1.305204
H  -6.527705 0.817353 -0.523361
H  5.771921 -0.767707 -1.270266
H  4.858835 -1.806863 -0.160939
H  -7.579826 -2.037702 -0.201996
H  -8.259743 -0.628599 0.637597
H  7.915009 -1.792736 -0.093605
H  6.902526 -2.687453 1.058731
H  -7.83509 -1.758027 2.882179
H  -8.885371 -2.760533 1.839669
H  -7.158497 -3.1766 2.035424
H  7.996623 -1.440904 2.992452
H  9.211594 -2.314233 2.014209
H  9.018191 -0.546707 1.832934
