program: Gaussian 09
title: 000243673
version: EM64L-G09RevD.01
frameworkgroup: C1[X(C12H14O4)]
method: RPBEPBE
basis: SDD
operation: Freq
keyword: #pfreq=noraman
keyword: PBEPBE/SDD
title: #p freq=noraman PBEPBE/SDD
converged: YES YES NO NO
title: Mulliken charges:
elementType: O O O O C C C C C C C C C C C C H H H H H H H H H H H H H H
charge: -0.291446 -0.291452 -0.222371 -0.222362 0.401627 0.401638 -0.585639 -0.346911 -0.346919 -0.483475 -0.483478 -0.183338 0.247351 0.247343 -0.656534 -0.656532 0.283692 0.247650 0.247687 0.247681 0.247658 0.304914 0.304903 0.231950 0.229169 0.217399 0.231613 0.231600 0.217397 0.229182
chargesum: 0.00000
title: Mulliken charges with hydrogens summed into heavy atoms:
elementType: O O O O C C C C C C C C C C C C
charge: -0.291446 -0.291452 -0.222371 -0.222362 0.401627 0.401638 -0.301947 -0.041997 -0.042016 0.011862 0.011862 0.048612 0.247351 0.247343 0.021648 0.021647
polarizability: 2.28596612e+02 -2.87419559e-04 1.43171308e+02 -2.25054185e-03 5.20574260e-01 7.67420320e+01
1716.lowfreq: -8.8701 -7.3257 -0.0010 -0.0008 -0.0006 0.9066 20.1697 24.6521 32.3526
frequency: 20.0698 24.6414 32.3481 33.5350 59.9669 72.3931 73.1351 131.9232 172.8001 174.9889 199.5777 244.9582 249.8834 250.6079 282.1428 326.9969 331.2456 389.7605 456.6745 526.9506 531.4176 556.6927 589.7838 599.8966 636.0243 669.8239 688.4416 720.4488 787.3131 790.8082 791.1991 802.9852 832.3557 897.6602 927.4919 934.4534 983.9499 992.5456 1010.6153 1016.0843 1065.6177 1070.9919 1085.0290 1085.0743 1093.4628 1097.8028 1109.5657 1115.8049 1189.1083 1203.0451 1243.4004 1243.4556 1281.3552 1335.3639 1336.8111 1382.8730 1398.1974 1398.2098 1437.9684 1440.7769 1443.6673 1463.4956 1470.2118 1470.2148 1479.9127 1479.9374 1577.3242 1616.0541 1656.5534 1660.3311 2998.5844 2998.6673 3001.3775 3001.3973 3046.2497 3046.2698 3098.5860 3098.6149 3104.0111 3104.0314 3148.5374 3183.9403 3215.4632 3219.0734
redmass: 2.8938 1.9914 5.6826 3.9229 2.9730 3.8084 3.9997 4.1064 1.2072 1.2150 5.7259 5.2834 5.5392 4.2715 4.7370 4.4253 5.0755 5.8830 3.0115 2.6656 2.6863 6.3626 6.6477 5.9861 4.9135 4.7774 2.3886 8.8574 4.7065 1.3368 1.3999 1.2919 4.8832 1.5753 1.3476 3.7280 6.1096 1.3064 1.9134 1.8662 2.5977 2.8714 1.6134 1.6107 1.7251 2.9250 1.9774 2.9033 1.1337 5.8016 1.1712 1.1713 1.3514 1.7227 1.7447 8.3286 1.2112 1.2113 1.6471 1.0841 1.5269 2.4516 1.0392 1.0390 1.0539 1.0515 7.2718 6.9197 9.8034 9.8306 1.0528 1.0531 1.0443 1.0441 1.0985 1.0985 1.1004 1.1004 1.1004 1.1004 1.0906 1.0928 1.0931 1.0963
irintensity: 1.7328 0.0001 0.0007 0.6043 6.7302 0.0012 0.2124 2.5629 1.5088 0.0106 0.1871 1.8842 1.0250 0.0556 24.1918 9.2000 0.5522 0.9341 3.0108 0.1614 0.1255 0.7499 0.5765 0.0003 2.6776 2.3999 19.6613 6.5864 5.2126 22.1863 0.6541 74.6779 6.4844 44.6821 0.0066 18.0824 0.8999 4.5253 15.3725 128.8486 525.3501 0.1848 2.9670 0.0913 6.7562 1056.0793 30.2932 46.1178 59.2462 20.3866 0.1350 0.1269 6.0054 90.0969 9.6458 43.0582 37.7154 4.2142 87.0580 0.8699 2.1710 149.0089 0.0259 25.7402 6.1368 22.5006 26.1082 97.3945 170.3433 184.0894 68.3988 2.2931 15.0801 2.7612 2.0503 5.1927 5.6259 49.9338 0.3679 61.4835 12.8450 0.0550 9.3788 0.0319
temp: 298.150 k
press: 1.00000 atm
elementType: 8 8 8 8 6 6 6 6 6 6 6 6 6 6 6 6 1 1 1 1 1 1 1 1 1 1 1 1 1 1
symmnumber: 1
zpe: 616142.7 jmol-1
zpe.correction: 0.234676 hartree
zpe.thermalcorrener: 0.251606 hartree
zpe.thermalcorrenthalpy: 0.252551 hartree
zpe.thermalcorrgfe: 0.186198 hartree
zpe.sumelectzpe: -765.389788 hartree
zpe.sumelectthermal: -765.372858 hartree
zpe.sumelectthermalent: -765.371914 hartree
zpe.sumelectthermalfe: -765.438266 hartree
dipole: 0.0002 -3.1781 -0.0703
dipole: 3.1788
quadrupole: -86.6789 -89.1836 -94.4967
quadrupole: 0.0001 0.0067 0.0331
quadrupole: 3.4408 0.9362 -4.3770 0.0001 0.0067 0.0331
hfenergy: -765.6244641 hartree
pointgroup: C01 [X(C12H14O4)]
dipole: 0.0016172 1.0039215 -0.7458293 debye
polarizability: 228.5963509|-0.1694739|118.635365|-0.0487471|-32.0650212|101.2782361 unknown
InChI: InChI=1S/C12H14O4/c1-3-11(13)15-9-6-5-7-10(8-9)16-12(14)4-2/h5-8H,3-4H2,1-2H3
charge 0 multiplicity 1
30 atoms
O  2.360842 0.677101 -0.221421
O  -2.357305 0.684632 -0.221063
O  4.068324 -0.620585 0.762664
O  -4.068847 -0.60865 0.761778
C  1.216384 -0.000308 0.302195
C  -1.214937 0.00352 0.302329
C  0.001588 0.566245 -0.132614
C  1.238002 -1.121739 1.166388
C  -1.23997 -1.117838 1.166535
C  4.609463 1.306124 -0.695852
C  -4.603949 1.320581 -0.695619
C  -0.001803 -1.656706 1.581012
C  3.707319 0.330022 0.041633
C  -3.704864 0.341274 0.041349
C  6.102965 0.971774 -0.537086
C  -6.098506 0.99106 -0.536664
H  0.002916 1.431795 -0.799303
H  4.384046 2.322425 -0.318396
H  4.306446 1.311283 -1.760081
H  -4.301164 1.32504 -1.759925
H  -4.375116 2.336034 -0.317958
H  2.180928 -1.554847 1.498155
H  -2.184201 -1.548016 1.498401
H  -0.00313 -2.52414 2.249706
H  6.330251 -0.030835 -0.93774
H  6.717874 1.712055 -1.078124
H  6.400669 0.978466 0.525177
H  -6.39601 0.998483 0.525651
H  -6.711095 1.733461 -1.077432
H  -6.329121 -0.010714 -0.937496
