program: Gaussian 09
title: 000243670
version: EM64L-G09RevD.01
frameworkgroup: C1[X(C10H20O2)]
method: RPBEPBE
basis: SDD
operation: Freq
keyword: #pfreq=noraman
keyword: PBEPBE/SDD
title: #p freq=noraman PBEPBE/SDD
converged: YES YES NO NO
title: Mulliken charges:
elementType: O O C C C C C C C C C C H H H H H H H H H H H H H H H H H H H H
charge: -0.288254 -0.251609 -0.402133 0.044727 -0.345866 -0.349434 -0.721874 -0.696526 -0.492054 0.263275 -0.350825 -0.683066 0.187613 0.206653 0.229067 0.184682 0.213179 0.196238 0.191342 0.214164 0.249505 0.220232 0.210562 0.210993 0.215605 0.229699 0.236892 0.207789 0.229644 0.222423 0.208271 0.209087
chargesum: 0.00000
title: Mulliken charges with hydrogens summed into heavy atoms:
elementType: O O C C C C C C C C C C
charge: -0.288254 -0.251609 -0.007867 0.273794 0.051995 0.038146 -0.037973 -0.059367 -0.025463 0.263275 0.086608 -0.043284
polarizability: 1.35118101e+02 4.87892256e+00 1.14662686e+02 -2.53043936e+00 1.45065172e+00 9.81807056e+01
1716.lowfreq: -18.9249 -13.9600 -6.9756 -4.3224 -0.0004 0.0002 0.0003 37.7034 40.4195
frequency: -12.4042 37.6450 40.1914 54.7309 73.9599 95.7078 116.2734 134.8830 148.8707 211.4519 225.1593 226.9049 228.9761 249.4975 290.1671 320.6298 366.3705 439.0621 458.7663 484.3140 565.8891 688.5793 724.2352 738.6063 754.5026 804.2920 867.9649 874.8418 891.7571 904.7617 913.7758 935.6630 992.3891 1031.4452 1050.2975 1055.7126 1076.8981 1088.3921 1109.0902 1116.2130 1132.5334 1149.5762 1172.0522 1216.2954 1222.8063 1251.1530 1277.1018 1279.0563 1285.4636 1297.0363 1308.2314 1328.7502 1346.2063 1358.7901 1361.7058 1386.3710 1390.9112 1391.1851 1442.6100 1447.9266 1465.5536 1466.7841 1474.8267 1476.0903 1477.2076 1477.4731 1478.6003 1486.5532 1487.2654 1632.7136 2959.6616 2965.7434 2972.6429 2972.7576 2974.4356 2978.2300 2988.6195 2998.7887 3003.2116 3011.7864 3025.9305 3039.9679 3047.8654 3056.9562 3069.3640 3071.9235 3075.4424 3078.9933 3084.7861 3099.5370
redmass: 2.2380 3.3595 3.5663 1.5335 2.6591 3.1620 3.0361 2.6720 2.3813 1.1494 1.1205 2.7106 1.2498 2.3564 3.6132 3.2899 3.2442 2.8610 3.1577 2.7698 3.0572 4.5337 1.1987 1.2080 1.7673 1.5941 1.3310 2.7205 1.8910 1.4961 1.5046 2.8486 1.4844 3.1305 1.9022 2.3166 2.2115 1.8754 2.3497 1.8393 2.4968 2.5024 2.0586 1.4482 1.3341 1.3056 1.2355 1.2007 1.0591 1.2511 1.3405 1.2837 1.5368 1.6849 1.7136 1.2264 1.2155 1.2204 1.0850 1.0813 1.0550 1.0677 1.0501 1.0689 1.0427 1.0445 1.0463 1.0794 1.0803 9.8554 1.0599 1.0615 1.0363 1.0362 1.0601 1.0648 1.0365 1.0621 1.0957 1.0905 1.0961 1.0961 1.1026 1.0978 1.1007 1.0993 1.0992 1.1010 1.0987 1.1005
irintensity: 0.0093 1.6073 0.4604 0.0213 0.0337 1.4027 0.6265 0.6733 2.2209 1.4897 0.4737 2.8631 1.3784 4.5074 2.2240 1.1588 3.8209 2.0554 4.9821 1.8862 3.5096 2.3968 4.9800 13.7257 8.8722 4.2665 0.4843 2.4039 5.2373 2.0759 4.1315 53.7761 33.6743 1.1179 69.1389 0.4199 4.7998 83.7499 30.6415 50.2143 21.4049 201.9071 1.1310 2.4300 7.0788 3.0160 14.5146 14.8350 1.1694 41.2478 2.5297 2.8475 4.7686 27.8069 1.5732 27.1566 8.0295 8.2338 19.7314 1.5820 9.8459 0.3823 4.6576 3.8266 14.6687 12.0263 9.0516 16.9775 15.8646 166.9512 4.5951 23.9421 35.3549 42.1303 58.7569 6.2938 28.5716 26.2029 6.8577 6.7207 4.0380 1.5533 44.1566 2.0216 87.3862 56.4305 48.8826 74.5286 44.3441 21.8144
temp: 298.150 k
press: 1.00000 atm
elementType: 8 8 6 6 6 6 6 6 6 6 6 6 1 1 1 1 1 1 1 1 1 1 1 1 1 1 1 1 1 1 1 1
symmnumber: 1
zpe: 740693.8 jmol-1
zpe.correction: 0.282115 hartree
zpe.thermalcorrener: 0.297078 hartree
zpe.thermalcorrenthalpy: 0.298023 hartree
zpe.thermalcorrgfe: 0.238756 hartree
zpe.sumelectzpe: -542.527801 hartree
zpe.sumelectthermal: -542.512838 hartree
zpe.sumelectthermalent: -542.511894 hartree
zpe.sumelectthermalfe: -542.571161 hartree
dipole: 1.0524 -0.4182 -1.4460
dipole: 1.8366
quadrupole: -72.2202 -74.3129 -79.1500
quadrupole: 4.9264 4.6158 -2.2500
quadrupole: 3.0075 0.9148 -3.9223 4.9264 4.6158 -2.2500
hfenergy: -542.8099168 hartree
pointgroup: C01 [X(C10H20O2)]
dipole: -0.4298911 -0.2106731 0.5412476 debye
polarizability: 134.6555002|-5.551333|115.2823682|-2.7568057|0.6756043|98.0236234 unknown
InChI: InChI=1S/C10H20O2/c1-4-6-8-9(3)12-10(11)7-5-2/h9H,4-8H2,1-3H3
charge 0 multiplicity 1
32 atoms
O  0.289032 0.57003 0.641958
O  1.795139 1.21933 -1.020573
C  -2.091613 1.038156 0.539299
C  -0.71221 1.590901 0.153728
C  -2.463573 -0.275586 -0.181656
C  -3.864199 -0.79853 0.209861
C  -0.378604 2.945915 0.791815
C  -4.235061 -2.114002 -0.508113
C  2.428479 -0.520793 0.621494
C  1.513113 0.50539 -0.028656
C  3.459424 -1.113559 -0.363957
C  4.461386 -2.05102 0.340747
H  -2.843947 1.81849 0.302833
H  -2.121835 0.887551 1.636935
H  -0.598488 1.649417 -0.946087
H  -2.425606 -0.117681 -1.280087
H  -1.702743 -1.045311 0.053086
H  -3.901244 -0.952328 1.307853
H  -4.623192 -0.022754 -0.020854
H  -1.10153 3.711408 0.454635
H  0.631432 3.278686 0.498793
H  -0.429997 2.881251 1.89338
H  -4.235732 -1.979731 -1.606387
H  -3.50825 -2.913319 -0.269447
H  -5.238617 -2.469857 -0.210576
H  2.960332 -0.009687 1.450941
H  1.811369 -1.308392 1.089691
H  2.925814 -1.66434 -1.162482
H  3.992774 -0.284923 -0.864533
H  5.185638 -2.471594 -0.380208
H  5.035355 -1.510588 1.117466
H  3.945757 -2.897633 0.832401
