program: Gaussian 09
title: 000243666
version: EM64L-G09RevD.01
frameworkgroup: C1[X(C10H11ClO2)]
method: RPBEPBE
basis: SDD
operation: Freq
keyword: #p
keyword: freq=noraman
keyword: PBEPBE/SDD
title: #p freq=noraman PBEPBE/SDD
converged: NO YES NO NO
title: Mulliken charges:
elementType: Cl O O C C C C C C C C C C H H H H H H H H H H H
charge: -0.086155 -0.287268 -0.257431 -0.384163 -0.283760 -0.557176 0.221106 0.199310 -0.342646 -0.337582 -0.217888 -0.216652 -0.220927 0.239409 0.253186 0.241279 0.242734 0.278697 0.270530 0.270241 0.273363 0.234624 0.233358 0.233809
chargesum: 0.00000
title: Mulliken charges with hydrogens summed into heavy atoms:
elementType: Cl O O C C C C C C C C C C
charge: -0.086155 -0.287268 -0.257431 0.108432 0.200253 -0.007949 0.221106 0.199310 -0.072405 -0.064219 0.016736 0.016706 0.012882
polarizability: 1.64906615e+02 -7.15373327e+00 1.24069308e+02 1.82346265e+01 1.10082865e+01 7.29244204e+01
1716.lowfreq: -3.8975 0.0013 0.0019 0.0023 2.4060 11.3813 26.7048 33.1396 56.1335
frequency: 26.6805 32.8051 56.0401 78.8607 111.8333 160.2787 177.2140 225.1258 318.1262 325.1402 389.2013 402.8700 437.4422 454.6740 503.0945 603.9833 613.9237 659.2601 681.1582 701.5974 747.7479 795.4638 799.3133 865.4735 867.8436 900.0257 955.6733 990.2188 996.2294 996.8141 1009.2368 1020.7504 1037.5010 1051.8083 1086.3831 1106.3179 1145.6503 1174.4021 1181.5711 1211.1980 1246.0586 1275.2300 1298.2589 1314.7551 1362.2787 1367.2294 1390.3912 1438.2780 1441.2250 1447.6370 1451.8595 1477.8239 1584.0734 1611.1864 1619.9018 2994.7854 3036.2406 3054.3108 3066.9804 3118.1283 3131.2272 3143.7527 3147.8373 3156.0750 3167.6314 3178.9684
redmass: 6.6739 5.3216 4.3245 6.0256 6.3261 4.5613 3.8824 3.6646 3.9942 4.5022 2.2775 2.8247 3.5799 5.6966 3.0787 4.5384 6.4330 6.1395 5.0407 1.5978 3.0734 2.1927 2.3578 1.2496 2.7573 2.7059 1.4191 5.8999 1.9309 1.4245 1.3294 2.6784 1.6163 2.8656 1.6756 2.2549 1.2447 1.0574 1.1262 1.2501 3.6922 1.1520 1.1726 1.3182 1.4933 1.3144 10.0778 2.2275 1.0891 1.1043 1.0993 2.2712 6.7230 6.1785 9.2096 1.0611 1.0623 1.0883 1.0643 1.1080 1.0856 1.0891 1.1114 1.0939 1.0978 1.0981
irintensity: 0.8140 1.2162 3.5567 2.2435 2.0759 0.9661 1.6915 5.8694 27.2191 1.2734 0.7556 0.0079 1.0545 2.7426 2.9020 20.2798 0.3677 5.4948 13.3126 98.6732 24.5134 18.4230 7.3348 0.1374 27.2625 16.5812 4.2984 2.3192 0.9829 0.3230 0.4211 95.6394 10.3222 207.3706 17.6384 13.4262 7.2200 0.2298 49.0541 56.2159 283.0811 2.4199 13.8017 2.0923 4.7812 3.7478 3.1297 16.2075 28.5646 26.8378 9.0465 4.7205 40.2177 10.8297 152.1066 9.5391 19.0510 14.5615 28.5609 4.5715 0.2767 10.5367 12.8975 14.8443 19.6999 8.3178
temp: 298.150 k
press: 1.00000 atm
elementType: 17 8 8 6 6 6 6 6 6 6 6 6 6 1 1 1 1 1 1 1 1 1 1 1
symmnumber: 1
zpe: 492987.4 jmol-1
zpe.correction: 0.187769 hartree
zpe.thermalcorrener: 0.200211 hartree
zpe.thermalcorrenthalpy: 0.201156 hartree
zpe.thermalcorrgfe: 0.146273 hartree
zpe.sumelectzpe: -997.220578 hartree
zpe.sumelectthermal: -997.208136 hartree
zpe.sumelectthermalent: -997.207192 hartree
zpe.sumelectthermalfe: -997.262075 hartree
dipole: 1.7576 -0.5093 0.9251
dipole: 2.0504
quadrupole: -77.8957 -85.5288 -82.0857
quadrupole: -10.3825 0.2169 0.6592
quadrupole: 3.9410 -3.6920 -0.2490 -10.3825 0.2169 0.6592
hfenergy: -997.4083474 hartree
pointgroup: C01 [X(C10H11Cl1O2)]
dipole: -0.7207729 0.2242907 0.2845121 debye
dipolederiv: -0.3877264 -0.1634205 0.1181052 -0.1640603 -0.3439165 0.0745757 0.164452 0.1453642 -0.3227576 -1.7272806 -0.1052595 0.1393234 -0.3084883 -0.4613563 0.1156109 0.39103 0.0975688 -0.4216215 -0.7960971 0.1837774 -0.0456889 0.0629968 -0.8436981 0.2315732 0.032982 0.2347703 -0.4303281 -0.0979342 -0.0667314 0.0200386 -0.0131463 -0.0524867 -0.0206288 0.0497162 0.0702618 -0.0916098 0.9631957 -0.0031962 -0.0119431 -0.1961569 0.1978051 0.0512938 0.0341913 0.0149109 0.2621262 0.4435046 0.200879 -0.2107753 0.2970726 0.3463974 -0.1852357 -0.2790441 -0.2017049 0.3640137 -0.580291 0.2017889 -0.0194782 0.2188871 -0.130025 0.0177984 -0.003814 0.0210635 -0.023674 2.15046 -0.2305053 -0.1285414 0.1209203 1.0151345 -0.3777852 -0.4408941 -0.3762958 0.4543922 0.0666741 -0.1408491 0.0427835 0.0807525 0.005381 -0.0755468 -0.0868185 -0.0336333 -0.0770592 0.0749519 0.0369125 -0.0688486 -0.1507671 -0.0244253 -0.020695 0.035777 -0.0616067 -0.0810374 0.0166379 0.137639 -0.123604 0.1505802 -0.1364154 -0.0397678 -0.1257293 -0.0422137 -0.1053362 -0.2386967 -0.034753 0.0342411 -0.0513443 0.0853758 -0.1296631 0.0470814 -0.1305757 -0.0871831 0.1082347 -0.0623735 -0.0239478 -0.0561946 0.0119093 -0.07131 -0.0222186 -0.0707789 -0.0882056 -0.1215369 0.1009764 -0.0205359 0.0473621 0.0323763 -0.0169981 -0.0576301 -0.0496006 0.1033673 0.1077477 -0.0535189 0.1030889 -0.0837905 0.0184764 0.0547747 0.0620598 -0.0039699 -0.0110157 -0.02633 0.0119256 0.0532592 0.0028625 0.0994205 0.0917911 0.0460583 0.0335583 -0.0209805 -0.0171265 -0.0539996 -0.022121 0.0622805 -0.0857834 -0.0737119 -0.0519831 -0.0175785 0.0824057 -0.0536025 0.0740425 0.0611102 0.0527135 0.0171737 0.0422511 0.081504 0.0676768 0.0452372 -0.0088006 -0.0720493 -0.0271674 -0.0852044 0.0452033 0.0031554 -0.0300724 -0.0205977 -0.1136702 0.1352805 0.0336543 -0.0103531 0.0012486 0.0221243 0.0767344 0.0041669 0.070088 0.1127933 0.0524011 -0.0547802 0.0598908 -0.0632344 0.0953477 0.0415426 0.0684375 0.0430948 0.1159921 -0.0539491 -0.0545377 0.0767757 -0.0648982 0.0662235 0.0683733 0.0863085 0.0663564 0.1023183 0.0749552 0.0259451 0.0024181 0.0478185 -0.0506428 0.1119911 -0.0079803 0.1142348 0.0923615 -0.084672 0.0884336 0.0019701 0.0917903 0.0704008 0.0298768 0.0024193 0.0296071 0.1394716 unknown
polarizability: 167.074611|-6.4312538|112.2061726|-12.1283814|-24.576573|82.6195597 unknown
InChI: InChI=1S/C10H11ClO2/c11-7-4-8-13-10(12)9-5-2-1-3-6-9/h1-3,5-6H,4,7-8H2
charge 0 multiplicity 1
24 atoms
Cl 4.602679 1.868382 -0.233675
O  1.156568 -0.107917 -0.539056
O  0.357379 -1.940878 0.665664
C  3.243175 -0.387228 0.798809
C  2.51974 -0.714725 -0.514478
C  3.429596 1.107595 1.053663
C  -1.180497 -0.160558 0.005164
C  0.143095 -0.8399 0.096866
C  -2.295347 -0.788426 0.620147
C  -1.346927 1.076653 -0.670822
C  -3.566645 -0.182639 0.560212
C  -2.621692 1.678135 -0.728067
C  -3.731995 1.051464 -0.113435
H  4.228294 -0.891135 0.790901
H  2.667668 -0.8162 1.642948
H  3.028573 -0.259519 -1.37857
H  2.425653 -1.806699 -0.641297
H  2.490734 1.671248 0.95274
H  3.907915 1.310386 2.022803
H  -2.142222 -1.743141 1.134059
H  -0.481105 1.547541 -1.14438
H  -4.426296 -0.667811 1.034674
H  -2.751437 2.63193 -1.250624
H  -4.720706 1.521543 -0.160046
