program: Gaussian 09
title: 000243665
version: EM64L-G09RevD.01
frameworkgroup: C1[X(C9H18O3)]
method: RPBEPBE
basis: SDD
operation: Freq
keyword: #pfreq=noraman
keyword: PBEPBE/SDD
title: #p freq=noraman PBEPBE/SDD
converged: YES YES NO NO
title: Mulliken charges:
elementType: O O O C C C C C C C C C H H H H H H H H H H H H H H H H H H
charge: -0.259647 -0.244124 -0.434293 -0.368203 -0.337349 -0.515354 -0.356179 0.245158 -0.692871 -0.289443 -0.393827 -0.315019 0.202232 0.224793 0.185332 0.187912 0.237810 0.247068 0.198447 0.196501 0.209512 0.209773 0.217498 0.224821 0.224270 0.226553 0.231388 0.188564 0.214253 0.334422
chargesum: 0.00000
title: Mulliken charges with hydrogens summed into heavy atoms:
elementType: O O O C C C C C C C C C
charge: -0.259647 -0.244124 -0.099870 0.058822 0.035895 -0.030476 0.038769 0.245158 -0.056087 0.159648 0.064115 0.087799
polarizability: 1.42260414e+02 -1.91703488e+00 9.46525624e+01 -1.23132250e+00 4.19229410e+00 9.03930485e+01
1716.lowfreq: -33.6207 -10.5986 -3.9544 -0.0006 -0.0006 0.0005 12.1923 21.2659 49.4129
frequency: -26.2288 15.6421 48.7766 59.9511 76.1251 89.1826 100.1666 115.5224 121.2636 194.0618 218.5513 224.3898 237.2502 290.2619 325.3482 368.5800 405.7551 447.1669 484.3216 587.0381 662.5096 723.0490 751.5364 783.7251 822.1083 836.2190 880.3279 894.1902 933.2932 952.0757 978.9658 1013.3656 1047.7890 1057.1130 1064.3742 1074.7600 1092.4614 1095.1273 1113.2898 1140.2946 1186.2795 1197.7232 1239.5320 1254.7284 1261.2237 1282.1344 1287.3889 1287.9260 1291.9631 1307.4384 1340.7886 1347.8468 1357.4973 1380.9810 1386.5105 1390.2305 1441.4317 1456.5553 1463.5943 1469.2848 1472.5650 1476.0241 1479.2921 1487.1889 1487.2428 1641.1237 2951.5422 2953.1516 2968.8484 2972.0428 2975.6573 2988.2194 2994.1141 3000.0154 3018.0010 3022.6891 3043.2874 3055.2918 3065.9526 3069.9813 3072.0873 3074.3573 3100.5857 3562.4354
redmass: 1.7044 4.7679 5.1234 3.5129 2.1028 3.2154 1.8265 2.5987 2.5878 3.6692 3.1843 1.1534 5.4989 3.4320 1.1226 3.6741 3.7171 3.7068 3.3331 3.6042 4.0162 1.0810 1.1911 1.1295 3.4897 1.3177 1.3387 2.1280 4.6211 1.2522 4.4824 4.0797 3.5563 3.1213 2.7718 2.2302 1.6098 1.7403 2.2957 2.5702 1.4076 1.5434 1.3325 1.2684 1.3047 1.0732 1.1431 1.1612 1.0755 1.3942 1.2531 1.5598 1.6847 1.3465 1.2166 1.2541 1.0863 1.0932 1.0679 1.0730 1.0758 1.0430 1.0709 1.0875 1.0904 9.1748 1.0588 1.0687 1.0584 1.0370 1.0656 1.0665 1.0925 1.0608 1.0594 1.1018 1.0979 1.0947 1.0995 1.1005 1.0992 1.1011 1.1074 1.0662
irintensity: 0.0690 0.0280 0.7369 3.6019 4.7048 2.0962 0.6024 1.2551 1.3978 2.1725 4.8465 0.1440 3.7908 13.6984 172.1084 2.6785 13.0494 7.7705 0.7813 7.1434 5.6499 14.2111 0.8345 7.9327 9.5137 3.6518 5.4019 12.4133 68.0513 1.8030 48.0564 28.8255 34.7986 24.0302 13.5848 22.0428 67.8351 34.7304 3.2118 208.3992 20.1383 4.4826 36.0025 8.7014 18.6135 0.6697 4.5001 1.2975 1.7751 36.1821 5.7176 10.9828 15.1296 0.9882 10.5920 23.8291 19.8670 9.5458 0.0821 0.7750 2.2536 12.6753 6.1515 23.4863 9.1872 145.3073 14.8742 63.1538 49.6521 34.3800 1.7798 40.6116 10.2283 8.0497 46.7421 17.5634 11.3789 10.6307 0.3832 130.5624 51.7405 20.6984 37.8848 7.6341
temp: 298.150 k
press: 1.00000 atm
elementType: 8 8 8 6 6 6 6 6 6 6 6 6 1 1 1 1 1 1 1 1 1 1 1 1 1 1 1 1 1 1
symmnumber: 1
zpe: 681205.6 jmol-1
zpe.correction: 0.259458 hartree
zpe.thermalcorrener: 0.274069 hartree
zpe.thermalcorrenthalpy: 0.275013 hartree
zpe.thermalcorrgfe: 0.215441 hartree
zpe.sumelectzpe: -578.426212 hartree
zpe.sumelectthermal: -578.411600 hartree
zpe.sumelectthermalent: -578.410656 hartree
zpe.sumelectthermalfe: -578.470228 hartree
dipole: -1.5656 -0.8280 -0.1747
dipole: 1.7796
quadrupole: -83.2883 -71.0145 -79.0091
quadrupole: -4.4425 5.9134 0.2831
quadrupole: -5.5177 6.7562 -1.2385 -4.4425 5.9134 0.2831
hfenergy: -578.6856693 hartree
pointgroup: C01 [X(C9H18O3)]
dipole: -0.6058127 -0.0541831 0.3468221 debye
polarizability: 142.3414072|0.8907066|89.4962979|1.000631|-3.5437522|95.4683201 unknown
InChI: InChI=1S/C9H18O3/c1-2-3-4-6-9(11)12-8-5-7-10/h10H,2-8H2,1H3
charge 0 multiplicity 1
30 atoms
O  1.251462 -0.335824 1.206479
O  0.425686 1.394727 -0.123978
O  5.352374 -0.386714 -1.644832
C  -2.202638 0.044603 -0.168639
C  -3.603774 -0.434752 0.269875
C  -1.128779 -0.240556 0.90307
C  -4.688633 -0.191926 -0.804216
C  0.220074 0.377337 0.577832
C  -6.09204 -0.651529 -0.353402
C  2.632834 0.199023 1.024097
C  3.261154 -0.32929 -0.27424
C  4.720937 0.14414 -0.428116
H  -1.919247 -0.453666 -1.116947
H  -2.221649 1.130095 -0.381407
H  -3.89535 0.087191 1.205687
H  -3.570241 -1.51722 0.514729
H  -1.454973 0.183165 1.876033
H  -0.993913 -1.323902 1.07075
H  -4.714714 0.887399 -1.057337
H  -4.404752 -0.72272 -1.735712
H  -6.100255 -1.733439 -0.121479
H  -6.411768 -0.111212 0.557645
H  -6.849279 -0.468644 -1.137725
H  2.58843 1.30387 1.023541
H  3.174669 -0.160121 1.91485
H  2.660591 0.026417 -1.133791
H  3.239342 -1.434326 -0.278797
H  4.771275 1.254908 -0.408088
H  5.348004 -0.245514 0.392225
H  4.853074 -0.057419 -2.434604
