program: Gaussian 09
title: 000243669
version: EM64L-G09RevD.01
frameworkgroup: C1[X(C10H18O5)]
method: RPBEPBE
basis: SDD
operation: Freq
keyword: #pfreq=noraman
keyword: PBEPBE/SDD
title: #p freq=noraman PBEPBE/SDD
converged: YES YES NO NO
title: Mulliken charges:
elementType: O O O O O C C C C C C C C C C H H H H H H H H H H H H H H H H H H
charge: -0.277739 -0.252320 -0.257466 -0.286235 -0.255177 -0.055453 0.186155 -0.360170 -0.313578 -0.699735 0.299044 -0.268495 -0.361047 -0.490167 -0.679375 0.240831 0.239141 0.241719 0.208179 0.244447 0.226073 0.238921 0.236770 0.220387 0.228326 0.214556 0.235452 0.206840 0.232300 0.203841 0.210152 0.226667 0.217155
chargesum: 0.00000
title: Mulliken charges with hydrogens summed into heavy atoms:
elementType: O O O O O C C C C C C C C C C
charge: -0.277739 -0.252320 -0.257466 -0.286235 -0.255177 0.185378 0.186155 0.120691 0.139048 0.002029 0.299044 0.180218 0.088961 0.152814 -0.025401
polarizability: 1.57041624e+02 -4.53088803e+00 1.21254040e+02 3.30890159e+00 -2.10920005e+00 9.93152464e+01
1716.lowfreq: -7.1491 -4.7844 0.0002 0.0007 0.0007 9.5723 18.3450 35.6055 48.9196
frequency: 17.3834 35.5983 48.7629 62.4927 77.2314 82.0262 94.5207 133.8713 166.6661 189.5547 200.9722 215.4484 224.0082 245.6655 266.6146 282.4977 299.6419 321.0776 334.4121 357.6281 428.4979 470.4045 490.2416 584.7427 654.0717 687.7744 706.9865 742.3087 767.9331 790.9445 829.0260 864.7910 879.1376 887.9245 894.7569 927.0155 935.1546 958.6489 1000.8155 1045.4353 1061.5250 1086.5256 1091.0419 1103.3594 1122.5112 1123.8487 1128.9527 1159.9669 1161.3444 1164.3913 1201.4109 1216.9361 1231.2525 1246.1947 1275.9879 1288.5507 1306.5607 1312.6232 1349.4955 1365.7637 1382.4522 1394.2612 1396.0152 1438.3395 1453.0951 1455.3958 1457.9749 1459.2415 1469.3045 1474.0880 1476.2198 1480.0070 1486.5624 1494.1906 1617.0648 2928.8036 2952.8315 2979.8214 3002.8576 3003.9671 3015.6453 3019.2994 3024.1227 3024.7949 3040.6605 3050.8901 3077.0580 3084.5870 3102.6392 3106.7526 3122.1771 3126.8639 3134.9431
redmass: 3.3209 3.5556 3.4997 2.5197 3.8536 3.1938 2.4518 2.8964 2.8980 1.1090 4.1090 1.1457 1.2749 3.5877 3.3424 3.3734 3.8136 4.3842 4.2162 3.7935 4.5829 2.2660 5.4497 4.6281 4.5590 6.3120 9.1679 2.2353 1.5484 3.1195 3.4035 2.8219 1.9947 3.4273 1.5342 1.8814 3.2228 4.3390 3.2950 3.0240 6.6781 2.6279 1.8441 1.5064 1.9176 2.1302 1.7851 1.6044 1.3706 1.4519 2.7719 1.5181 3.6107 1.2428 1.2084 1.1115 1.3014 1.2370 1.3253 1.3801 1.4908 1.2708 1.2040 1.1522 1.1001 1.0463 1.0512 1.0535 1.0725 1.0728 1.0502 1.0424 1.0837 1.0770 9.7945 1.0343 1.0568 1.0360 1.0603 1.1025 1.0990 1.0355 1.0583 1.0654 1.0912 1.1009 1.1019 1.0991 1.0978 1.1084 1.1003 1.1036 1.1008
irintensity: 0.4507 0.9140 0.5256 0.6851 1.6356 0.3785 8.9322 2.1643 2.5639 1.0361 0.5115 0.2807 5.0086 5.0800 3.9932 2.2843 16.5766 7.3101 3.4002 5.8271 0.6555 7.0001 6.1455 19.4392 3.5743 5.2013 13.2131 7.4963 3.7682 38.0638 1.2787 16.6150 12.8326 19.0332 8.7657 4.9714 33.7549 105.8655 43.3062 7.0568 206.2853 294.9158 91.9412 6.6144 3.5921 6.5523 2.2945 16.8928 7.4921 5.1574 3.3857 40.0600 76.9863 3.5026 4.0029 3.1319 2.2694 0.3910 2.6180 0.2056 0.5526 35.1140 10.4944 0.3512 8.1402 11.8623 12.1581 11.2430 5.0916 23.1922 3.8501 12.8272 17.3081 9.3411 145.5616 80.4076 48.2351 34.7367 8.6637 76.8733 5.1958 6.6464 37.3789 31.8405 53.6469 0.6035 32.8543 38.5303 33.0835 34.9359 14.7507 19.2216 12.3810
temp: 298.150 k
press: 1.00000 atm
elementType: 8 8 8 8 8 6 6 6 6 6 6 6 6 6 6 1 1 1 1 1 1 1 1 1 1 1 1 1 1 1 1 1 1
symmnumber: 1
zpe: 717363.8 jmol-1
zpe.correction: 0.273229 hartree
zpe.thermalcorrener: 0.290712 hartree
zpe.thermalcorrenthalpy: 0.291656 hartree
zpe.thermalcorrgfe: 0.225887 hartree
zpe.sumelectzpe: -766.726359 hartree
zpe.sumelectthermal: -766.708877 hartree
zpe.sumelectthermalent: -766.707933 hartree
zpe.sumelectthermalfe: -766.773701 hartree
dipole: -1.4910 -1.8111 -0.3515
dipole: 2.3721
quadrupole: -76.5331 -87.4469 -91.7071
quadrupole: -3.0754 -1.2958 -0.5962
quadrupole: 8.6959 -2.2179 -6.4780 -3.0754 -1.2958 -0.5962
hfenergy: -766.9995884 hartree
pointgroup: C01 [X(C10H18O5)]
dipole: 0.6235414 0.6733706 0.1694157 debye
polarizability: 156.4464951|-4.3487897|115.8135301|-5.7393783|10.2272091|105.3508854 unknown
InChI: InChI=1S/C10H18O5/c1-4-5-13-9(11)10(2)14-7-8(15-10)6-12-3/h8H,4-7H2,1-3H3
charge 0 multiplicity 1
33 atoms
O  -1.1501 -0.232715 -1.485312
O  -0.890446 -1.957922 0.090532
O  2.154128 -0.745381 -0.191431
O  -3.845512 1.221379 0.621008
O  0.536187 0.697397 0.6640
C  -2.3451 -0.18051 -0.591081
C  -0.153994 -1.130573 -0.881635
C  -1.981653 -1.091462 0.610345
C  -2.626287 1.270663 -0.198244
C  0.45394 -2.023654 -1.94932
C  0.858269 -0.270584 -0.065838
C  3.209685 -0.035361 0.600432
C  3.768992 1.160088 -0.182657
C  -4.243224 2.544493 1.095877
C  4.927102 1.832998 0.587336
H  -3.195133 -0.588828 -1.166135
H  -1.626505 -0.496043 1.470383
H  -2.795704 -1.763342 0.915642
H  -2.789901 1.89157 -1.10482
H  -1.769372 1.679726 0.374719
H  0.953696 -1.411325 -2.717574
H  1.195034 -2.705681 -1.5058
H  -0.355805 -2.604705 -2.418611
H  3.975781 -0.810382 0.767497
H  2.771409 0.286408 1.562393
H  4.121733 0.811826 -1.17162
H  2.957266 1.889578 -0.358183
H  -3.453211 3.003557 1.727319
H  -5.154647 2.397874 1.696759
H  -4.465883 3.228886 0.249393
H  5.760136 1.126298 0.761564
H  5.326925 2.690082 0.017369
H  4.589793 2.210844 1.570391
