program: Gaussian 09
title: 000243683
version: EM64L-G09RevD.01
frameworkgroup: C1[X(C14H26O4)]
method: RPBEPBE
basis: SDD
operation: Freq
keyword: #pfreq=noraman
keyword: PBEPBE/SDD
title: #p freq=noraman PBEPBE/SDD
converged: YES YES NO NO
title: Mulliken charges:
elementType: O O O O C C C C C C C C C C C C C C H H H H H H H H H H H H H H H H H H H H H H H H H H
charge: -0.285629 -0.283662 -0.245294 -0.250649 0.048201 0.058233 -0.385605 -0.385957 -0.354095 -0.350487 -0.705543 -0.716682 -0.499116 -0.513277 -0.693449 -0.696571 0.272232 0.283994 0.226778 0.225995 0.191340 0.210522 0.186956 0.205180 0.219943 0.193757 0.238650 0.183124 0.222782 0.254886 0.209784 0.220747 0.245132 0.214577 0.238969 0.250400 0.255321 0.237440 0.208570 0.208893 0.219017 0.207104 0.212045 0.215441
chargesum: 0.00000
title: Mulliken charges with hydrogens summed into heavy atoms:
elementType: O O O O C C C C C C C C C C C C C C
charge: -0.285629 -0.283662 -0.245294 -0.250649 0.274979 0.284229 0.016257 0.006179 0.059604 0.071288 -0.018090 -0.036225 -0.009747 -0.020516 -0.056968 -0.061981 0.272232 0.283994
polarizability: 1.70000312e+02 1.29753876e+00 1.75329545e+02 1.42844859e+00 1.23558792e+00 1.45254778e+02
1716.lowfreq: -17.5575 -8.3724 -7.6942 -0.0008 -0.0008 0.0005 8.6621 19.1802 37.3879
frequency: -15.5698 18.3162 37.3526 39.9000 41.7072 49.6621 55.3559 61.8594 74.7803 104.0667 113.0485 131.8577 157.6156 164.7519 183.7341 202.1044 213.9010 223.5990 225.1810 227.8605 263.0332 293.9513 300.2285 330.2943 351.5983 409.4413 423.2608 450.9167 453.3692 470.8778 475.8832 561.7857 593.2770 661.3914 702.5050 721.7296 729.6883 766.7330 775.8814 842.5970 854.1881 866.7139 867.2131 873.2714 877.1639 932.1247 934.7545 950.1490 974.4922 989.6130 992.0331 1027.6213 1029.8881 1033.3763 1070.5012 1072.0799 1110.3401 1114.2984 1120.9166 1134.2716 1135.4146 1149.8390 1169.4260 1171.1716 1222.6175 1234.1356 1236.3792 1247.5240 1270.6535 1274.1728 1288.5531 1293.7166 1312.4148 1319.2388 1327.3325 1328.6876 1332.9036 1340.4971 1363.0520 1366.2043 1385.6873 1386.6384 1388.3713 1391.1353 1447.4120 1449.5774 1452.4979 1453.3510 1464.3776 1465.1095 1470.7765 1473.3210 1475.0592 1475.4524 1476.3163 1478.7983 1484.2657 1485.3069 1632.9297 1635.4243 2967.8866 2969.9660 2970.6381 2973.4031 2976.5083 2979.2215 2988.4387 2991.4061 3010.8773 3014.1773 3019.2525 3023.6764 3027.2997 3036.6820 3043.3045 3044.9327 3066.4686 3068.5381 3070.4658 3073.2884 3085.5257 3087.0697 3097.1312 3097.4965 3104.8773 3113.9786
redmass: 3.4922 3.0767 4.2280 4.1704 5.2665 6.1510 2.0198 3.2162 1.8241 2.7263 2.7104 4.8595 2.7538 2.5370 2.3609 1.4840 1.2076 1.2522 1.3768 1.4004 3.0357 2.8375 2.9501 3.4126 3.4499 2.6827 2.6816 2.5932 2.5687 3.3028 3.4175 4.6030 3.9615 3.8793 3.2972 1.3968 1.3568 2.0173 2.5898 3.3980 2.1491 1.4116 1.4854 1.8812 2.1686 2.0153 1.9890 2.8504 2.4417 1.4148 1.4574 2.8120 2.1277 2.0667 2.4459 2.4420 1.9143 1.8877 1.6217 2.2584 2.2669 2.1346 2.0782 2.0496 1.6213 1.3689 1.3500 1.6323 1.3048 1.2983 1.1033 1.1085 1.2507 1.2639 1.3335 1.4416 1.4220 1.5131 1.7285 1.6767 1.2301 1.2226 1.2223 1.2186 1.0803 1.0807 1.1032 1.0897 1.0552 1.0555 1.0539 1.0515 1.0472 1.0476 1.0458 1.0463 1.0724 1.0815 9.8678 10.3077 1.0523 1.0388 1.0475 1.0579 1.0599 1.0608 1.0365 1.0369 1.0888 1.0893 1.0610 1.0937 1.0922 1.0598 1.1013 1.1007 1.0993 1.1006 1.1009 1.0993 1.0987 1.0988 1.1025 1.1008 1.1003 1.1031
irintensity: 0.1344 0.3103 0.2421 0.8052 2.8257 0.5259 0.0491 0.3904 0.1416 0.5654 0.0834 0.8335 1.6771 0.1991 7.7220 1.9298 0.3998 0.9304 1.1896 1.4869 1.6959 1.2771 2.0543 3.7467 5.7650 2.8400 6.0240 5.6885 2.0211 2.3410 9.2638 4.0123 1.3547 2.6391 0.8268 1.8110 4.4151 15.8497 13.0592 10.7766 2.2572 0.1870 0.3667 5.4885 3.0637 0.6637 11.5157 59.4007 79.8177 13.0570 25.0807 5.6982 29.9394 27.2593 12.5974 17.8803 233.8005 57.4327 22.0813 5.2594 12.4800 109.4689 6.0090 4.2750 66.5587 17.5605 5.2032 147.3046 3.6226 4.5107 0.4064 0.7959 15.2766 2.7590 3.0152 2.0275 1.6378 17.1012 6.7893 6.6772 19.5425 4.7958 15.2715 21.1927 1.3426 2.3978 22.9911 14.8406 9.9953 6.6897 6.2509 5.5065 11.3364 19.5431 10.0533 3.8204 16.4131 14.5263 130.4561 250.5323 30.4287 33.9888 14.9667 5.6383 49.3557 46.6655 30.7041 22.4365 3.4503 2.6466 13.6812 8.1691 9.7658 15.4102 11.9127 7.4227 123.4287 35.3253 49.8165 58.1143 40.2877 49.1814 1.6403 22.9508 16.8106 12.4598
temp: 298.150 k
press: 1.00000 atm
elementType: 8 8 8 8 6 6 6 6 6 6 6 6 6 6 6 6 6 6 1 1 1 1 1 1 1 1 1 1 1 1 1 1 1 1 1 1 1 1 1 1 1 1 1 1
symmnumber: 1
zpe: 995223.4 jmol-1
zpe.correction: 0.379061 hartree
zpe.thermalcorrener: 0.401110 hartree
zpe.thermalcorrenthalpy: 0.402054 hartree
zpe.thermalcorrgfe: 0.325468 hartree
zpe.sumelectzpe: -848.543607 hartree
zpe.sumelectthermal: -848.521557 hartree
zpe.sumelectthermalent: -848.520613 hartree
zpe.sumelectthermalfe: -848.597200 hartree
dipole: -0.3795 3.2342 -0.9321
dipole: 3.3871
quadrupole: -104.7074 -119.9693 -109.2225
quadrupole: 0.7720 6.4329 5.4837
quadrupole: 6.5923 -8.6696 2.0772 0.7720 6.4329 5.4837
hfenergy: -848.9226673 hartree
pointgroup: C01 [X(C14H26O4)]
dipole: 0.1557122 1.0606754 0.7915445 debye
polarizability: 169.5454699|-2.1226468|172.7882287|2.8009369|8.5301601|148.2509373 unknown
InChI: InChI=1S/C14H26O4/c1-5-7-11(3)17-13(15)9-10-14(16)18-12(4)8-6-2/h11-12H,5-10H2,1-4H3
charge 0 multiplicity 1
44 atoms
O  -1.31955 -0.818547 -0.224658
O  2.19666 -0.328672 0.551041
O  -1.63822 -3.087636 -0.686087
O  2.141117 -1.160041 -1.632058
C  -2.322636 -0.436358 -1.292496
C  2.728417 0.999215 0.061576
C  -2.893855 0.919819 -0.855121
C  2.159427 2.055952 1.019626
C  -3.706682 0.863989 0.457333
C  0.635504 2.264638 0.872202
C  -1.601829 -0.409129 -2.646502
C  4.260208 0.918847 0.042766
C  0.055001 -2.389333 0.965319
C  1.434588 -2.583452 0.264772
C  -4.244346 2.248015 0.879162
C  0.073828 3.275424 1.894203
C  -1.053641 -2.176057 -0.054352
C  1.950713 -1.314988 -0.402976
H  -3.104284 -1.22067 -1.288493
H  2.340798 1.140486 -0.965534
H  -3.537609 1.295013 -1.67669
H  -2.058342 1.640166 -0.75009
H  2.688068 3.01205 0.827988
H  2.402802 1.760289 2.059689
H  -3.065287 0.451508 1.259327
H  -4.552744 0.157487 0.333564
H  0.12195 1.2910 0.98111
H  0.4182 2.618118 -0.157287
H  -0.775036 0.322733 -2.635183
H  -1.188194 -1.400623 -2.8941
H  -2.312781 -0.123552 -3.443603
H  4.654575 0.720932 1.055407
H  4.602339 0.119209 -0.636117
H  4.684415 1.875132 -0.314596
H  -0.180898 -3.30723 1.530647
H  0.110474 -1.535103 1.658174
H  1.367004 -3.373654 -0.500598
H  2.166642 -2.89446 1.032047
H  -4.902306 2.677306 0.099805
H  -3.413803 2.960638 1.045512
H  -4.827007 2.185493 1.816282
H  0.55148 4.267658 1.783755
H  0.251854 2.931481 2.93065
H  -1.016712 3.410009 1.768185
