program: Gaussian 09
title: 000243647
version: EM64L-G09RevD.01
frameworkgroup: C1[X(C14H28N3PS)]
method: RPBEPBE
basis: SDD
operation: Freq
keyword: #p
keyword: freq=noraman
keyword: PBEPBE/SDD
title: #p freq=noraman PBEPBE/SDD
converged: YES YES NO NO
title: Mulliken charges:
elementType: S P N N N C C C C C C C C C C C C C C H H H H H H H H H H H H H H H H H H H H H H H H H H H H
charge: -0.291574 0.712522 -0.370430 -0.447290 -0.466121 -0.387713 -0.414099 -0.294939 -0.362660 -0.322422 -0.315626 -0.412197 -0.342467 -0.416632 -0.358864 -0.350646 -0.398986 -0.348958 -0.396055 0.256720 0.244750 0.248536 0.272111 0.232712 0.220699 0.199341 0.247442 0.221728 0.240785 0.204481 0.228279 0.210422 0.195910 0.194887 0.206285 0.214664 0.199380 0.188977 0.210748 0.194885 0.188663 0.185616 0.202829 0.197826 0.188145 0.186457 0.201877
chargesum: 0.00000
title: Mulliken charges with hydrogens summed into heavy atoms:
elementType: S P N N N C C C C C C C C C C C C C C
charge: -0.291574 0.712522 -0.370430 -0.447290 -0.466121 0.113757 0.106549 0.158472 0.084123 0.140091 0.117134 -0.005865 0.058705 -0.002588 0.040861 0.032902 -0.010541 0.037013 -0.007721
polarizability: 2.14444437e+02 6.81832503e-02 2.18720600e+02 -8.02173514e+00 4.48579399e+00 1.92671261e+02
1716.lowfreq: -18.1902 -11.8681 -0.0009 0.0011 0.0026 0.9619 22.6722 35.6882 39.8086
frequency: 17.7361 35.5312 39.5216 53.2035 62.7630 97.4352 99.2146 111.9230 138.0010 147.1978 160.8525 191.1078 201.2230 207.8418 250.1870 269.7177 276.9296 294.2830 307.0520 315.7347 337.6283 350.0330 365.9515 374.4724 397.8241 407.5233 419.5512 486.0292 487.6752 517.9272 532.4824 590.7669 654.8450 663.3139 754.0496 759.6213 782.6015 803.2328 803.9894 805.4109 835.3824 836.2914 869.4435 873.7839 874.9837 875.2680 880.7474 901.7377 907.2582 968.4997 971.6144 988.8225 1002.2626 1004.2828 1031.4670 1037.2517 1057.7546 1059.8894 1072.8900 1100.5489 1103.0528 1111.1764 1120.9286 1128.5223 1129.0806 1153.7431 1165.0107 1171.1431 1180.4256 1183.0792 1214.2701 1216.3880 1228.4949 1230.3900 1235.3551 1261.1205 1264.1222 1278.7542 1280.9857 1306.4381 1312.2398 1332.6284 1336.7469 1338.7671 1341.6667 1348.0217 1349.8955 1352.4799 1353.8619 1361.2512 1367.1585 1372.2590 1377.3202 1434.5737 1448.9671 1449.9146 1452.3658 1454.5093 1458.3905 1460.1782 1463.2042 1465.1334 1466.4228 1476.2706 1479.9303 1482.6520 1485.0735 2931.3064 2936.9331 2954.6093 2954.8013 2965.2224 2968.5488 2970.3982 2971.9987 2972.5228 2973.9381 2976.6361 2979.5248 3005.0247 3009.3519 3014.0596 3015.1819 3026.2825 3030.9546 3032.0332 3034.2607 3035.1437 3041.7277 3042.7663 3056.3850 3063.5219 3079.3997 3172.1875 3189.0140
redmass: 3.3906 3.8792 3.4832 3.5253 3.3454 3.5830 2.8828 3.8301 3.9592 3.1735 4.3376 2.2887 2.0568 2.7966 3.6986 2.7239 3.1380 4.0740 2.2976 2.6209 2.4650 2.5953 4.3840 3.4125 3.3840 2.6985 2.6318 1.5049 1.4972 3.0027 4.6581 7.2498 3.3341 3.1553 2.2242 2.1863 7.3292 1.5095 1.5572 1.3007 1.7870 1.8019 3.2151 2.0818 2.3807 2.1299 2.4335 2.0662 2.1142 2.2188 2.1885 1.0744 1.8453 1.7335 1.7683 1.8849 2.0379 2.0298 1.2681 1.9269 1.9466 1.3282 1.2870 2.1441 2.1242 1.3658 2.8616 2.0642 1.3299 1.5489 1.5186 1.5420 2.4534 1.4846 1.3109 1.2922 1.3293 1.1841 1.1920 1.2405 1.2684 1.3560 1.3343 1.2964 1.3592 1.4164 1.4158 1.3897 1.3312 1.3757 1.3341 1.3086 1.2927 1.0760 1.1036 1.1517 1.0867 1.0823 1.0813 1.0859 1.0818 1.0886 1.0925 1.0756 1.0806 1.0794 1.0829 1.0650 1.0659 1.0613 1.0613 1.0622 1.0685 1.0613 1.0632 1.0631 1.0615 1.0638 1.0640 1.0955 1.0972 1.0968 1.0960 1.0995 1.1002 1.0996 1.0993 1.1004 1.1008 1.1003 1.0520 1.0589 1.0922 1.1162 1.1164
irintensity: 0.2651 0.2090 0.4198 0.4016 1.5103 0.2648 0.9826 3.3165 4.6489 1.3974 5.5712 2.0671 1.1964 1.2812 0.4430 4.8230 3.3633 4.5642 0.6284 0.3432 0.8458 3.0137 5.0480 2.9569 5.1804 2.3991 1.2916 4.0378 3.1961 21.4125 27.7136 68.3729 68.4497 18.9446 6.4731 11.6039 5.1040 16.0743 20.3433 19.3850 8.7382 11.7852 123.7938 18.5289 40.9173 20.2410 18.4843 31.2281 39.4262 4.1602 1.8407 2.0958 13.5713 5.5509 62.1142 39.7313 24.6535 0.5567 8.4319 11.6781 5.1324 4.9996 8.6532 0.8634 2.6962 0.0505 50.4590 29.1367 10.0857 13.4187 3.0468 10.9950 38.4320 9.3379 2.2971 7.1627 1.6640 4.7305 7.3909 4.5693 5.9914 0.2546 0.2143 7.5212 0.9568 1.5941 1.7984 3.7675 0.4496 0.6136 0.7303 6.8370 5.3293 9.5091 5.1292 3.4065 9.3981 11.5718 3.6564 9.7587 1.0879 9.8717 18.4504 30.3859 0.8866 12.7652 4.8992 33.7721 42.7087 43.4746 26.1861 19.2058 17.0701 49.5616 81.1753 25.4803 32.2320 48.6103 35.5317 15.2701 34.2950 57.3741 26.8256 50.7698 69.0569 42.2093 11.3692 19.7735 229.2809 21.1945 21.6191 32.8187 10.5170 1.7650 10.1686
temp: 298.150 k
press: 1.00000 atm
elementType: 16 15 7 7 7 6 6 6 6 6 6 6 6 6 6 6 6 6 6 1 1 1 1 1 1 1 1 1 1 1 1 1 1 1 1 1 1 1 1 1 1 1 1 1 1 1 1
symmnumber: 1
zpe: 1077301.0 jmol-1
zpe.correction: 0.410322 hartree
zpe.thermalcorrener: 0.431442 hartree
zpe.thermalcorrenthalpy: 0.432387 hartree
zpe.thermalcorrgfe: 0.359449 hartree
zpe.sumelectzpe: -1452.231535 hartree
zpe.sumelectthermal: -1452.210415 hartree
zpe.sumelectthermalent: -1452.209471 hartree
zpe.sumelectthermalfe: -1452.282408 hartree
dipole: 0.7904 -2.0022 -2.7998
dipole: 3.5317
quadrupole: -124.5158 -131.3545 -137.2222
quadrupole: 2.6733 4.1971 -9.7543
quadrupole: 6.5150 -0.3236 -6.1914 2.6733 4.1971 -9.7543
hfenergy: -1452.6418574 hartree
pointgroup: C01 [X(C14H28N3P1S1)]
dipole: 0.3188234 -0.6201804 -1.2018083 debye
polarizability: 213.4188726|0.9971866|217.5051377|-9.5655476|6.4959423|194.9122878 unknown
InChI: InChI=1S/C14H28N3PS/c19-18(17-13-14-17,15-9-5-1-2-6-10-15)16-11-7-3-4-8-12-16/h1-14H2
charge 0 multiplicity 1
47 atoms
S  -0.759803 2.195461 2.348294
P  -0.182719 1.298919 0.531954
N  0.324625 2.456367 -0.783781
N  -1.466238 0.364907 -0.187055
N  1.204824 0.223275 0.543796
C  -0.585269 3.6606 -0.960132
C  0.789524 3.841541 -0.355069
C  -1.230054 -0.21656 -1.5329
C  -2.823156 0.353022 0.402283
C  1.119559 -0.860448 1.557862
C  2.552622 0.689476 0.127981
C  -2.09416 -1.462611 -1.837054
C  -3.138202 -0.948927 1.178708
C  2.157896 -1.985605 1.334777
C  3.063355 -0.075024 -1.117134
C  -2.180372 -2.507568 -0.696232
C  -3.320959 -2.216801 0.312707
C  2.36719 -2.406806 -0.142625
C  3.438225 -1.555858 -0.873667
H  -1.437499 3.764326 -0.274426
H  -0.770332 3.928761 -2.004661
H  1.611152 4.242235 -0.957136
H  0.825037 4.043443 0.724533
H  -0.158069 -0.488299 -1.580821
H  -1.408769 0.54344 -2.324324
H  -3.569164 0.523825 -0.400617
H  -2.892923 1.203745 1.10574
H  0.099933 -1.286842 1.488577
H  1.230872 -0.451701 2.586922
H  3.263232 0.582802 0.973787
H  2.504583 1.762689 -0.116882
H  -1.663389 -1.925132 -2.747735
H  -3.121925 -1.150969 -2.111031
H  -4.062863 -0.783707 1.769626
H  -2.320855 -1.099187 1.911221
H  1.816796 -2.852477 1.934545
H  3.136703 -1.688401 1.760928
H  3.952468 0.45661 -1.516275
H  2.273848 -0.001487 -1.889772
H  -1.207411 -2.565861 -0.167175
H  -2.358765 -3.507413 -1.139615
H  -4.269541 -2.132916 -0.258999
H  -3.442503 -3.088952 0.986637
H  1.402696 -2.353929 -0.686307
H  2.691949 -3.465847 -0.170174
H  4.375351 -1.601831 -0.279307
H  3.669802 -2.023779 -1.85187
