program: Gaussian 09
title: 000243723
version: EM64L-G09RevD.01
frameworkgroup: C1[X(C23H22O7)]
method: RPBEPBE
basis: SDD
operation: Freq
keyword: #pfreq=noraman
keyword: PBEPBE/SDD
title: #p freq=noraman PBEPBE/SDD
converged: YES YES NO NO
title: Mulliken charges:
elementType: O O O O O O O C C C C C C C C C C C C C C C C C C C C C C C H H H H H H H H H H H H H H H H H H H H H H
charge: -0.258702 -0.236273 -0.276999 -0.197822 -0.371655 -0.282212 -0.283938 -0.317141 -0.127050 0.358846 -0.365228 0.080333 0.100351 0.106335 0.166349 0.215318 0.187053 0.221363 -0.554027 0.185942 -0.666154 -0.325399 -0.522217 -0.223442 0.226242 0.219518 -0.689130 -0.710702 -0.537317 -0.521504 0.267109 0.245031 0.206772 0.239582 0.287646 0.248350 0.270732 0.274916 0.234305 0.218547 0.229990 0.242136 0.206451 0.239990 0.233682 0.360284 0.227164 0.238724 0.231035 0.227407 0.260018 0.209389
chargesum: 0.00000
title: Mulliken charges with hydrogens summed into heavy atoms:
elementType: O O O O O O O C C C C C C C C C C C C C C C C C C C C C C C
charge: -0.258702 -0.236273 -0.276999 -0.197822 -0.011371 -0.282212 -0.283938 -0.050032 0.117981 0.358846 0.081126 0.080333 0.100351 0.106335 0.166349 0.215318 0.187053 0.221363 -0.266381 0.185942 -0.417804 -0.054667 -0.247301 0.010863 0.226242 0.219518 0.001543 -0.030578 0.159606 0.175310
polarizability: 3.40284597e+02 3.48748508e+01 2.81072220e+02 2.24124264e+00 -1.47838064e+01 2.51015284e+02
1716.lowfreq: -5.9388 -1.9203 -0.0007 -0.0006 0.0007 12.4224 13.3198 27.1040 35.1762
frequency: 13.1753 27.1026 35.1318 42.0578 61.9152 76.9999 81.2610 91.2846 106.0669 124.0589 146.5651 160.7607 175.1438 189.4266 191.5272 198.6324 208.3490 227.4250 235.5310 248.1065 251.0277 263.8537 279.4960 286.3980 298.3393 307.1721 324.8359 327.7020 347.9625 359.8143 388.4973 406.6921 418.0475 419.6322 429.7996 434.8381 435.2569 467.4907 477.9879 491.1748 529.1273 549.7620 557.2544 593.2410 602.6143 604.8389 617.6730 634.7332 649.0899 654.3184 689.0581 707.3739 720.4196 724.9951 733.0578 757.2445 775.6606 787.6319 794.1200 816.8296 831.1205 862.7714 870.8118 876.5344 883.9571 892.3227 905.0035 919.2848 942.6665 951.2679 963.1034 973.1677 985.8048 996.4520 1012.2654 1050.0801 1060.9229 1092.7008 1105.5383 1110.9778 1112.3394 1115.7320 1134.1336 1150.8863 1159.9939 1161.9340 1167.9320 1173.4198 1179.6669 1211.1718 1218.5533 1220.9678 1242.5644 1251.3600 1252.5841 1260.1936 1281.1717 1294.8252 1309.0812 1318.9641 1342.0922 1366.7701 1372.8474 1375.6840 1384.8319 1389.7721 1393.2160 1395.8446 1424.0399 1429.2735 1444.5115 1450.8712 1453.7323 1454.8564 1458.5491 1465.4862 1467.9729 1474.7867 1479.5269 1481.6705 1484.3690 1499.2416 1563.5772 1576.4979 1588.4624 1608.2398 1623.8828 1645.2112 2963.6090 2973.5066 2977.0081 2984.3260 2985.1062 2995.4082 2998.8483 3052.3302 3082.3676 3085.1472 3094.5333 3094.9347 3096.1059 3106.5022 3122.7985 3125.6100 3135.1402 3145.0710 3159.8404 3174.7051 3179.8499 3538.1976
redmass: 5.3142 4.8964 4.1775 3.8053 2.8526 3.6877 4.0657 4.4420 5.0480 4.1690 1.9692 3.5960 2.9442 1.0664 3.9850 4.3616 3.6864 3.6019 1.2880 2.2301 2.4612 2.5495 3.4157 3.4091 3.5513 3.8011 4.4723 4.7521 4.7822 3.2869 4.2142 3.7111 2.8372 5.2527 8.2062 5.8224 1.6059 4.9645 3.5434 5.1851 6.0947 3.7617 5.9058 5.1453 4.8531 5.7605 5.8769 6.2138 6.3213 7.0014 4.0572 5.2106 5.4251 3.5277 2.7137 4.0065 3.4608 4.5002 2.7098 2.8741 4.0438 2.0755 2.5055 2.0999 2.8308 2.4397 5.0632 1.5644 1.9744 2.4162 3.6508 1.2952 5.6867 1.3098 5.2950 3.7150 4.5773 2.2768 1.5540 1.2419 1.2630 3.3769 3.2121 1.5762 1.4618 1.8314 1.5083 1.9602 3.1757 1.3868 2.4980 1.7254 1.2645 2.1419 1.3757 1.4849 3.8911 3.3478 2.3829 1.7782 3.7149 1.7618 1.4902 1.4936 4.9922 3.0400 1.6373 3.0726 3.8988 1.2438 1.2508 1.0516 1.1214 1.0858 1.0498 1.0509 1.0960 1.1517 1.5291 1.0550 1.8390 2.6164 9.2713 9.9525 8.6156 8.9347 7.1727 7.7944 1.0324 1.0349 1.0701 1.0821 1.0347 1.0355 1.0829 1.1040 1.0967 1.0996 1.0970 1.1011 1.0995 1.1009 1.1002 1.1046 1.0878 1.0919 1.0900 1.0973 1.0920 1.0657
irintensity: 0.4579 0.9349 2.3732 0.8399 7.6369 0.9741 7.0416 1.4417 3.4271 1.7804 1.7229 3.2993 1.1259 0.0308 0.6041 4.5743 0.5620 1.0123 1.2339 2.7383 3.1587 3.8612 0.8904 6.5899 1.8604 3.4841 3.0810 8.2120 5.4799 2.8785 8.7896 2.7296 48.2386 1.9065 9.8509 15.0868 60.7232 7.7630 3.6286 18.1018 20.3211 2.0265 1.7864 4.0570 2.2757 13.2199 7.1013 34.4787 9.2707 5.4711 27.4774 9.2291 1.9577 11.8694 4.7876 1.9836 31.4532 16.8504 18.2093 12.6332 19.3594 2.8598 17.5695 72.7954 1.3767 24.9364 20.0663 2.9294 1.7271 10.5431 20.3773 2.7431 81.5790 0.6218 80.7456 47.8261 125.2626 59.1350 92.6737 13.2056 0.6691 174.5458 331.0624 40.4195 45.0774 114.7316 22.3584 21.3196 28.9497 56.3831 31.4016 8.5816 31.5806 43.7329 9.1573 37.0801 67.8535 7.6413 70.6243 110.1012 83.4870 49.0370 56.5492 54.1030 19.6421 21.0725 25.4683 29.8521 39.7578 11.6328 8.4025 4.8099 11.1213 23.8867 2.3480 18.5313 7.8882 126.8477 2.7797 29.8013 18.3137 213.4342 366.7442 4.5270 187.2270 394.7197 27.1357 113.0938 52.6653 85.9662 16.2553 19.9284 14.5055 26.3803 93.1388 40.7155 41.7789 7.2096 17.0602 23.1157 24.7988 27.2524 27.8534 19.3083 3.4580 4.2767 3.1605 9.8792 0.4296 35.9029
temp: 298.150 k
press: 1.00000 atm
elementType: 8 8 8 8 8 8 8 6 6 6 6 6 6 6 6 6 6 6 6 6 6 6 6 6 6 6 6 6 6 6 1 1 1 1 1 1 1 1 1 1 1 1 1 1 1 1 1 1 1 1 1 1
symmnumber: 1
zpe: 1054069.0 jmol-1
zpe.correction: 0.401474 hartree
zpe.thermalcorrener: 0.428870 hartree
zpe.thermalcorrenthalpy: 0.429815 hartree
zpe.thermalcorrgfe: 0.343554 hartree
zpe.sumelectzpe: -1413.985200 hartree
zpe.sumelectthermal: -1413.957804 hartree
zpe.sumelectthermalent: -1413.956859 hartree
zpe.sumelectthermalfe: -1414.043120 hartree
dipole: -4.5965 -0.1810 -1.6164
dipole: 4.8758
quadrupole: -169.2993 -176.6269 -149.2380
quadrupole: 11.5103 -1.8760 -2.1239
quadrupole: -4.2446 -11.5721 15.8167 11.5103 -1.8760 -2.1239
hfenergy: -1414.3866739 hartree
pointgroup: C01 [X(C23H22O7)]
dipole: -1.8015653 -0.0870272 0.6531128 debye
polarizability: 338.7079709|-33.6521211|288.0171134|-13.8054389|-3.0030398|245.6470175 unknown
InChI: InChI=1S/C23H22O7/c1-23(2)6-5-11-15(30-23)8-13(24)20-21(25)19-12-7-16(26-3)17(27-4)9-14(12)28-10-18(19)29-22(11)20/h5-9,18-19,24H,10H2,1-4H3
charge 0 multiplicity 1
52 atoms
O  -0.787164 0.873947 -1.749778
O  1.72194 2.31172 -1.999131
O  -4.493017 -0.295942 1.094779
O  0.906399 -2.95108 -1.4929
O  -1.238885 -3.675717 0.021017
O  4.530769 -0.92783 1.673791
O  4.850081 1.913173 1.587652
C  1.184348 -0.622544 -2.104783
C  0.248136 0.427888 -2.717381
C  2.143319 0.023209 -1.097236
C  1.007186 1.691375 -3.122332
C  0.387371 -1.793959 -1.481595
C  -0.909396 -1.443184 -0.873874
C  -1.418699 -0.105261 -0.984262
C  2.362999 1.421706 -1.105365
C  -2.597528 0.328742 -0.330147
C  -3.302727 -0.622444 0.461102
C  -4.807278 1.174605 1.357132
C  2.859118 -0.76383 -0.162204
C  -1.692546 -2.363363 -0.094807
C  -2.871703 -1.960047 0.562938
C  -3.181591 1.65744 -0.508033
C  3.238715 2.017613 -0.173465
C  -4.251835 2.045645 0.241002
C  3.757502 -0.186734 0.757603
C  3.936374 1.234701 0.763741
C  -4.155387 1.526848 2.714316
C  -6.341706 1.212303 1.425509
C  4.401539 -2.386906 1.626784
C  4.801879 1.642671 3.039485
H  1.772041 -1.077215 -2.927176
H  -0.280456 0.005364 -3.59676
H  1.728292 1.432844 -3.924872
H  0.316505 2.469929 -3.483015
H  2.704049 -1.846548 -0.179787
H  -3.461166 -2.661747 1.163151
H  -2.747263 2.312633 -1.267533
H  3.390553 3.099903 -0.177704
H  -4.72735 3.022498 0.097893
H  -4.382737 2.574365 2.983652
H  -4.542355 0.864767 3.509278
H  -3.058294 1.419897 2.65801
H  -6.684002 2.231142 1.68117
H  -6.780944 0.924758 0.455764
H  -6.706657 0.515247 2.199109
H  -1.859187 -4.199478 0.591251
H  3.370015 -2.709795 1.866845
H  5.097871 -2.761652 2.391618
H  4.687835 -2.7816 0.633011
H  5.556616 2.315256 3.475138
H  5.045302 0.589909 3.254511
H  3.800817 1.889982 3.443587
