program: Gaussian 09
title: 000243624
version: EM64L-G09RevD.01
frameworkgroup: C1[X(C16H16O4)]
method: RPBEPBE
basis: SDD
operation: Freq
keyword: #pfreq=noraman
keyword: PBEPBE/SDD
title: #p freq=noraman PBEPBE/SDD
converged: YES YES NO NO
title: Mulliken charges:
elementType: O O O O C C C C C C C C C C C C C C C C H H H H H H H H H H H H H H H H
charge: -0.229713 -0.246432 -0.267247 -0.268680 0.000503 -0.043230 -0.351616 -0.344421 0.351855 0.364912 -0.328458 -0.339504 -0.380222 -0.384854 -0.220074 -0.219660 -0.196492 -0.195787 -0.253041 -0.255111 0.207861 0.236623 0.195826 0.248832 0.238321 0.246982 0.274485 0.286441 0.252748 0.254341 0.224611 0.225149 0.228925 0.228843 0.228603 0.228681
chargesum: 0.00000
title: Mulliken charges with hydrogens summed into heavy atoms:
elementType: O O O O C C C C C C C C C C C C C C C C
charge: -0.229713 -0.246432 -0.267247 -0.268680 0.208365 0.193393 0.093042 0.140883 0.351855 0.364912 -0.053972 -0.053064 -0.127473 -0.130513 0.004537 0.005489 0.032433 0.033056 -0.024438 -0.026430
polarizability: 2.68872301e+02 1.14205074e+01 1.46646256e+02 5.55077298e+00 4.90598250e-01 1.34010686e+02
1716.lowfreq: -14.6735 -3.1608 -0.0008 -0.0006 -0.0005 2.9528 21.6191 32.3252 36.2783
frequency: 21.3522 32.2096 36.2457 50.5714 68.3240 98.9709 124.2632 185.9362 190.8936 238.6196 247.0781 274.0191 301.9609 323.7923 347.4347 409.3294 410.6136 431.4271 479.3227 496.2768 501.9123 508.7525 568.3005 579.5693 586.3031 612.9134 614.7612 690.8899 692.6092 704.9664 758.0969 760.4861 772.3341 787.8979 804.0412 829.1358 832.7659 864.5216 876.0036 898.6131 902.8462 932.3564 961.5419 964.8646 983.0802 984.1157 986.4915 986.7433 1002.9492 1018.7462 1023.1272 1033.8136 1038.5835 1066.3301 1079.6040 1082.3920 1085.2952 1111.5065 1166.9510 1167.2482 1174.9448 1177.9487 1197.6446 1205.1674 1219.6651 1239.6557 1292.4596 1311.8119 1313.8376 1318.9183 1323.8204 1330.1285 1364.3403 1369.4930 1385.9402 1388.6402 1437.7823 1443.6022 1443.8788 1448.5912 1474.9999 1477.1517 1593.5306 1595.9423 1609.5283 1610.4340 2923.8416 2960.6729 3020.9523 3033.1394 3107.7476 3124.9098 3129.5338 3129.9322 3139.4120 3139.6062 3157.7321 3158.3406 3169.1772 3169.7749 3175.9822 3177.0076
redmass: 5.7563 5.3456 3.9966 4.1054 5.5661 6.0166 5.4732 4.5862 4.1216 4.8576 4.4308 4.8035 4.3019 3.0325 4.1185 2.9224 2.9480 8.1901 3.1874 3.7715 3.2802 3.8881 6.1364 5.8820 5.9344 6.5027 6.4064 2.1739 2.2063 4.9782 1.6133 1.5893 3.6880 6.2420 3.7056 1.2698 1.2723 4.6729 4.3348 1.4349 1.4701 4.9184 1.3790 1.3780 1.5390 2.1926 2.4082 2.7896 8.0538 2.4656 2.0823 2.4111 2.3190 2.8391 1.9533 1.5863 2.3083 2.6188 1.1351 1.1160 1.2290 1.3341 2.1730 2.6358 1.2121 1.1284 1.2396 1.4017 1.3203 1.3494 1.2004 1.1721 1.4890 1.2867 8.0789 6.3882 1.0873 2.3022 2.3085 1.0959 2.2516 2.2355 6.4153 6.5077 6.4056 6.3526 1.0837 1.0684 1.0860 1.0606 1.0954 1.1059 1.0850 1.0850 1.0896 1.0896 1.0938 1.0939 1.0960 1.0962 1.0991 1.0986
irintensity: 0.0749 0.6382 0.4613 0.4157 0.0873 0.3725 2.0853 0.8010 15.2905 0.1818 9.2997 4.8425 1.7480 0.4260 5.3547 0.0372 0.0346 0.3745 2.5214 25.0965 9.9789 8.3352 11.3170 4.7731 4.4169 5.3018 3.2237 28.4387 27.9834 6.9004 91.9849 81.5979 4.0601 36.1218 99.0261 0.5527 0.2497 88.7965 73.1870 8.0644 11.5186 324.3991 0.0962 0.2231 0.9458 0.2868 4.7499 1.3799 41.2840 3.6832 26.0306 37.2226 109.7940 165.1475 75.6074 7.9235 41.0233 5.5799 40.5736 11.8625 77.1369 68.1480 356.0226 66.8079 8.3421 16.1912 6.3806 14.7765 0.3615 18.0509 16.4797 5.0970 22.6024 2.1670 10.4195 15.4989 13.1799 3.7066 4.7024 5.0757 192.7592 38.3811 34.3706 25.6844 109.3641 9.1433 46.1457 49.6487 44.8247 16.6408 13.1047 13.2121 1.1857 1.0966 16.2215 15.0601 32.2756 26.9464 11.4686 14.5434 4.6009 3.6061
temp: 298.150 k
press: 1.00000 atm
elementType: 8 8 8 8 6 6 6 6 6 6 6 6 6 6 6 6 6 6 6 6 1 1 1 1 1 1 1 1 1 1 1 1 1 1 1 1
symmnumber: 1
zpe: 748023.2 jmol-1
zpe.correction: 0.284907 hartree
zpe.thermalcorrener: 0.301828 hartree
zpe.thermalcorrenthalpy: 0.302772 hartree
zpe.thermalcorrgfe: 0.237941 hartree
zpe.sumelectzpe: -918.697890 hartree
zpe.sumelectthermal: -918.680969 hartree
zpe.sumelectthermalent: -918.680024 hartree
zpe.sumelectthermalfe: -918.744856 hartree
dipole: -0.1348 1.6095 -1.4484
dipole: 2.1695
quadrupole: -102.8427 -108.4514 -117.7618
quadrupole: 1.7630 -1.2149 -0.3059
quadrupole: 6.8426 1.2339 -8.0765 1.7630 -1.2149 -0.3059
hfenergy: -918.9827966 hartree
pointgroup: C01[X(C16H16O4)]
dipole: -0.020443 0.7348173 0.4337618 debye
polarizability: 269.1665314|-5.8620522|135.1036133|9.722979|2.9705725|145.2590992 unknown
InChI: InChI=1S/C16H16O4/c1-3-7-13(8-4-1)19-15-11-18-16(12-17-15)20-14-9-5-2-6-10-14/h1-10,15-16H,11-12H2
charge 0 multiplicity 1
36 atoms
O  0.854418 -0.290571 1.072517
O  -1.015406 1.571793 -0.062649
O  2.113532 -0.182748 -0.924221
O  -2.132574 -0.405296 0.808981
C  1.218171 0.555802 -0.085465
C  -1.388592 0.807647 1.127422
C  -0.144055 0.381914 1.920679
C  -0.03511 0.853553 -0.91328
C  3.471835 -0.306244 -0.527024
C  -3.468961 -0.272907 0.35153
C  3.932178 -0.070119 0.78919
C  -4.041186 0.94285 -0.094942
C  4.360145 -0.71065 -1.548974
C  -4.222768 -1.469888 0.361697
C  5.310451 -0.220848 1.066544
C  -5.392857 0.947372 -0.51215
C  5.730392 -0.866224 -1.252209
C  -5.566107 -1.447914 -0.066069
C  6.214204 -0.615859 0.054678
C  -6.160907 -0.238175 -0.500273
H  1.693023 1.491704 0.291863
H  -2.023133 1.505435 1.707159
H  0.295786 1.290527 2.385939
H  -0.410327 -0.349509 2.698423
H  0.180333 1.536262 -1.748196
H  -0.46429 -0.094267 -1.28417
H  3.227814 0.178103 1.587467
H  -3.441177 1.854609 -0.157657
H  3.9660 -0.892264 -2.553468
H  -3.745441 -2.391844 0.707706
H  5.672548 -0.042969 2.085428
H  -5.839165 1.885384 -0.861393
H  6.42043 -1.179174 -2.043539
H  -6.149403 -2.375321 -0.056087
H  7.278782 -0.735599 0.28148
H  -7.204879 -0.223364 -0.830535
