program: Gaussian 09
title: 000243629
version: EM64L-G09RevD.01
frameworkgroup: C1[X(C20H24O4)]
method: RPBEPBE
basis: SDD
operation: Freq
keyword: #pfreq=noraman
keyword: PBEPBE/SDD
title: #p freq=noraman PBEPBE/SDD
converged: YES YES NO NO
title: Mulliken charges:
elementType: O O O O C C C C C C C C C C C C C C C C C C C C H H H H H H H H H H H H H H H H H H H H H H H H
charge: -0.280634 -0.280359 -0.276012 -0.276307 0.144923 0.145906 0.352411 0.351190 -0.298071 -0.298444 -0.375911 -0.374921 -0.365745 -0.364780 -0.238063 -0.237671 -0.251297 -0.251762 -0.232968 -0.233195 -0.687556 -0.687279 -0.243766 -0.243395 0.219144 0.215170 0.219044 0.215200 0.278578 0.278188 0.266658 0.266706 0.215812 0.225209 0.215119 0.224963 0.226779 0.226740 0.221918 0.221932 0.206764 0.229633 0.221814 0.206705 0.229552 0.222089 0.225038 0.224950
chargesum: 0.00000
title: Mulliken charges with hydrogens summed into heavy atoms:
elementType: O O O O C C C C C C C C C C C C C C C C C C C C
charge: -0.280634 -0.280359 -0.276012 -0.276307 0.144923 0.145906 0.352411 0.351190 0.136243 0.135800 -0.097332 -0.096733 -0.099087 -0.098074 0.202958 0.202411 -0.024518 -0.025022 -0.011050 -0.011263 -0.029346 -0.028933 -0.018728 -0.018445
polarizability: 2.08775482e+02 3.39433240e+01 2.12806120e+02 1.62781991e+00 -1.38070124e+00 2.39919245e+02
1716.lowfreq: -12.5867 -9.2430 -3.4438 -0.0008 -0.0007 -0.0004 21.4357 23.3980 42.9513
frequency: 20.8218 23.1962 42.9404 51.8151 55.8544 66.8592 82.1350 97.6296 126.6997 139.3547 145.3152 150.3996 202.2173 208.8147 235.3456 243.9549 246.8136 255.9608 265.5613 293.4290 299.0014 313.4122 319.9007 346.3395 360.0623 394.6257 408.3131 413.5257 449.0594 492.2028 509.1364 516.7522 539.7185 615.6102 615.7878 627.9748 637.6906 676.9327 691.0163 706.4812 708.6929 748.2534 759.7179 803.8674 804.4489 806.6798 850.9153 852.1180 859.7500 861.2921 877.4356 890.3037 914.3711 935.7086 944.8999 962.8502 980.6869 986.6309 989.3891 990.8538 991.4718 996.0073 996.9111 1008.0454 1018.7801 1030.8083 1033.0971 1034.2994 1044.8077 1054.6646 1063.6398 1083.9954 1085.1163 1094.7062 1112.7879 1128.0998 1137.8048 1139.4640 1169.8945 1170.0493 1182.9211 1185.0818 1214.8058 1226.2591 1245.3999 1247.2406 1252.0774 1257.6067 1312.6682 1314.7652 1347.6547 1354.8633 1358.3295 1364.6960 1382.4526 1382.7011 1392.9530 1393.8173 1433.9874 1434.2429 1441.6576 1443.3125 1458.1571 1459.0953 1478.1657 1480.2605 1480.4929 1480.8226 1499.7948 1502.0470 1591.4322 1592.0230 1612.1264 1612.7871 2981.5125 2982.5810 2990.9091 2991.0896 2995.4898 2999.4307 3035.0085 3036.1675 3080.8348 3087.4974 3087.9629 3088.1471 3097.2294 3097.3960 3120.6866 3120.8757 3132.5078 3132.8467 3147.4336 3147.7656 3159.8968 3160.1718 3183.8656 3183.9109
redmass: 2.4935 2.2953 4.2563 3.9206 4.5371 3.8806 3.6211 3.5068 2.1104 2.2918 3.3749 3.5554 3.0236 2.5559 1.6740 2.8461 2.3371 2.6365 4.3418 3.1517 3.2215 3.4428 5.1557 5.1050 3.8129 7.0130 2.8786 2.9260 4.8379 4.4992 3.9234 4.6420 2.6785 6.4080 6.4027 6.1472 4.3500 5.6797 5.3659 1.8977 1.8974 1.9372 1.7754 1.2625 1.1003 2.3348 4.2820 2.9938 1.2506 1.2546 3.2074 3.2477 2.9721 1.6616 1.7054 5.1041 2.4363 1.4233 2.0735 5.6536 5.8549 1.3330 1.3660 3.6510 2.9864 2.1590 2.2556 2.8197 3.7349 3.4628 4.9379 1.5746 1.5899 2.0862 2.2290 2.6679 1.4479 1.4489 1.0522 1.0517 1.1169 1.1181 1.3646 3.1955 1.2006 1.2038 2.3458 1.3098 1.3219 1.3182 1.2514 1.3128 1.3143 1.2616 9.0381 8.7117 1.2641 1.2639 2.2023 2.1974 1.0944 1.0978 1.0412 1.0413 2.2760 1.1007 1.8716 1.1052 1.0834 1.0835 6.3743 6.3653 6.1341 6.1258 1.0549 1.0546 1.0372 1.0374 1.0651 1.0578 1.1062 1.1061 1.0998 1.1060 1.0992 1.0991 1.1013 1.1013 1.0847 1.0847 1.0892 1.0892 1.0941 1.0939 1.0990 1.0987 1.0951 1.0951
irintensity: 0.0102 0.0379 0.0818 0.2617 0.0010 0.4759 0.4882 1.0254 3.3515 0.9469 0.6492 1.5702 1.0314 4.4275 0.2399 0.5099 0.1340 4.7179 4.4985 4.3659 12.7148 3.8550 3.3997 12.4756 0.7939 0.4880 0.1486 0.2963 4.6266 2.0600 11.7013 1.4965 5.5993 0.4076 0.3470 4.8495 6.3584 9.9841 3.7674 92.0213 8.8829 103.9105 2.9618 4.4737 2.7287 7.8624 0.2213 6.4936 0.1579 0.3281 1.1747 38.3097 104.4940 45.3105 26.0903 180.0290 0.5735 3.1773 2.7190 0.0118 0.8671 0.9537 3.7999 19.9648 12.0105 22.2184 63.5692 0.8495 208.8474 4.3906 124.2859 5.2247 0.2963 2.3411 22.2437 21.4575 2.5323 4.8711 0.4229 0.1152 7.7176 5.7332 4.4152 50.5557 3.1772 4.1173 39.1824 2.3243 0.9197 0.6417 0.0619 1.2095 2.6284 3.5843 0.0760 0.1402 23.7956 22.3494 12.4207 8.7686 5.7230 5.6568 11.1058 12.1608 9.6709 12.6695 6.0584 2.8408 3.1110 1.9752 0.0304 0.2826 0.0162 0.8093 41.7775 31.4939 55.0314 2.8627 60.3713 39.6518 17.6391 24.8411 38.1051 24.6378 31.7857 39.4070 13.6212 63.4340 0.0700 0.1441 11.6721 13.8575 55.3041 13.3730 7.3813 35.9573 2.7525 8.0967
temp: 298.150 k
press: 1.00000 atm
elementType: 8 8 8 8 6 6 6 6 6 6 6 6 6 6 6 6 6 6 6 6 6 6 6 6 1 1 1 1 1 1 1 1 1 1 1 1 1 1 1 1 1 1 1 1 1 1 1 1
symmnumber: 1
zpe: 1036384.1 jmol-1
zpe.correction: 0.394738 hartree
zpe.thermalcorrener: 0.417791 hartree
zpe.thermalcorrenthalpy: 0.418735 hartree
zpe.thermalcorrgfe: 0.341449 hartree
zpe.sumelectzpe: -1075.596062 hartree
zpe.sumelectthermal: -1075.573008 hartree
zpe.sumelectthermalent: -1075.572064 hartree
zpe.sumelectthermalfe: -1075.649350 hartree
dipole: -0.0037 0.0474 -1.0205
dipole: 1.0216
quadrupole: -141.8462 -132.0270 -124.3104
quadrupole: -0.8092 -0.0037 -0.3469
quadrupole: -9.1183 0.7009 8.4174 -0.8092 -0.0037 -0.3469
hfenergy: -1075.9907995 hartree
pointgroup: C01 [X(C20H24O4)]
dipole: -0.0024752 0.4011111 0.0255602 debye
polarizability: 195.01997|-2.1335371|239.9087695|30.1087505|1.0482136|226.5721084 unknown
InChI: InChI=1S/C20H24O4/c1-3-21-19(17-11-7-5-8-12-17)20(22-4-2,24-16-15-23-19)18-13-9-6-10-14-18/h5-14H,3-4,15-16H2,1-2H3
charge 0 multiplicity 1
48 atoms
O  -1.420083 2.055093 -0.156676
O  1.394743 2.030068 0.409836
O  -0.815216 0.609223 1.670389
O  0.802322 0.822921 -1.58789
C  -0.787316 0.780262 0.221779
C  0.773324 0.809106 -0.129285
C  -1.557072 -0.309485 -0.520948
C  1.552522 -0.359902 0.469446
C  -0.743777 3.229176 0.433542
C  0.709493 3.264298 -0.026485
C  -1.618892 -1.616941 0.021314
C  1.627218 -1.586765 -0.235216
C  -2.204412 -0.034739 -1.749087
C  2.194278 -0.237942 1.724955
C  -2.162092 0.684193 2.29106
C  2.147375 0.990718 -2.194087
C  -2.320775 -2.637829 -0.656511
C  2.33621 -2.679846 0.309954
C  -2.906021 -1.056176 -2.425875
C  2.903229 -1.331184 2.26872
C  -1.950452 0.559505 3.799036
C  1.936736 1.023561 -3.70702
C  -2.96704 -2.361493 -1.883372
C  2.976535 -2.556239 1.564636
H  -0.793268 3.177289 1.538304
H  -1.314488 4.09923 0.067816
H  0.759687 3.355517 -1.128647
H  1.273143 4.084939 0.448267
H  -1.114945 -1.826866 0.970771
H  1.12726 -1.676594 -1.205452
H  -2.148959 0.975941 -2.160174
H  2.128028 0.711507 2.261257
H  -2.638254 1.646093 2.019642
H  -2.797802 -0.133966 1.901251
H  2.604008 1.927731 -1.82122
H  2.799966 0.148618 -1.893082
H  -2.362046 -3.645088 -0.22669
H  2.387467 -3.624081 -0.243927
H  -3.404517 -0.834818 -3.376591
H  3.397433 -1.228771 3.241677
H  -2.921806 0.606545 4.324975
H  -1.464146 -0.399983 4.046563
H  -1.308824 1.376009 4.174094
H  2.906088 1.145162 -4.224588
H  1.468565 0.086594 -4.055285
H  1.278534 1.862609 -3.992981
H  -3.513252 -3.152795 -2.409802
H  3.527789 -3.403702 1.988407
