program: Gaussian 09
title: 000243604
version: EM64L-G09RevD.01
frameworkgroup: C1[X(C6H8O6)]
method: RPBEPBE
basis: SDD
operation: Freq
keyword: #p
keyword: freq=noraman
keyword: PBEPBE/SDD
title: #p freq=noraman PBEPBE/SDD
converged: NO NO NO NO
title: Mulliken charges:
elementType: O O O O O O C C C C C C H H H H H H H H
charge: -0.262719 -0.262716 -0.404798 -0.404788 -0.210842 -0.210849 -0.063259 -0.063259 -0.327310 -0.327310 0.158055 0.158061 0.253015 0.253012 0.232893 0.239630 0.239631 0.232892 0.385331 0.385331
chargesum: 0.00000
title: Mulliken charges with hydrogens summed into heavy atoms:
elementType: O O O O O O C C C C C C
charge: -0.262719 -0.262716 -0.019467 -0.019457 -0.210842 -0.210849 0.189756 0.189753 0.145213 0.145213 0.158055 0.158061
polarizability: 1.11373807e+02 -7.62783128e-01 7.30242859e+01 -2.94201363e+00 -7.13605499e+00 6.46582404e+01
1716.lowfreq: -29.4111 -8.5344 -0.0005 0.0004 0.0008 5.0575 17.4443 19.6355 51.5546
frequency: 9.7232 17.4444 51.5546 122.2823 155.1666 201.2045 238.4667 251.4895 287.2442 351.8583 405.4773 438.2498 501.1106 546.2308 594.1155 601.5047 620.8112 631.7047 699.6898 721.1911 800.3093 840.4818 904.8770 939.9449 974.2456 998.1972 1023.2148 1032.2722 1051.5065 1057.9553 1090.1715 1096.8453 1208.0075 1223.8493 1227.1623 1245.9520 1300.1387 1305.6659 1337.1960 1348.3734 1373.0195 1375.3078 1445.6169 1447.1473 1668.4729 1668.7133 2989.9334 2990.6850 3015.9052 3016.1821 3094.3801 3094.4395 3503.9798 3504.0014
redmass: 5.8659 9.7295 7.1137 6.7722 6.8400 4.9606 2.6242 8.3219 5.7532 3.8617 6.5027 7.4354 3.1952 2.8114 1.7903 4.1984 1.3373 3.2840 2.7506 4.4004 2.8891 3.7446 6.5877 3.0717 4.8144 3.4309 3.0509 3.8302 2.8352 4.7045 2.5544 2.0300 1.1175 1.3072 1.3846 1.2823 1.3363 1.2604 1.3644 1.2823 1.7282 1.8080 1.0860 1.0857 9.1796 9.2264 1.0644 1.0642 1.0838 1.0834 1.1020 1.1020 1.0639 1.0639
irintensity: 0.0000 4.5409 1.8463 0.0263 0.0000 0.0000 19.1344 0.0000 3.4995 0.0000 31.3154 0.0000 0.0000 32.7775 104.0023 0.0001 0.0000 101.2358 218.1724 0.0000 0.0000 26.9583 0.0000 18.5225 79.1431 0.0000 492.9745 0.0001 0.0000 113.9231 0.0001 86.4598 0.0000 1.8944 0.0000 4.4916 0.0000 34.7231 24.2553 0.0000 0.0003 70.6330 19.5000 0.0000 0.0654 410.2925 43.1210 0.0015 0.0320 47.9640 0.0781 33.5773 55.3443 0.8781
temp: 298.150 k
press: 1.00000 atm
elementType: 8 8 8 8 8 8 6 6 6 6 6 6 1 1 1 1 1 1 1 1
symmnumber: 1
zpe: 380655.7 jmol-1
zpe.correction: 0.144984 hartree
zpe.thermalcorrener: 0.156605 hartree
zpe.thermalcorrenthalpy: 0.157549 hartree
zpe.thermalcorrgfe: 0.103890 hartree
zpe.sumelectzpe: -683.819458 hartree
zpe.sumelectthermal: -683.807838 hartree
zpe.sumelectthermalent: -683.806893 hartree
zpe.sumelectthermalfe: -683.860552 hartree
dipole: 0.0000 -0.0005 -0.0005
dipole: 0.0007
quadrupole: -54.0072 -73.1367 -73.4992
quadrupole: 4.8523 -10.9819 4.0634
quadrupole: 12.8738 -6.2557 -6.6182 4.8523 -10.9819 4.0634
hfenergy: -683.9644421 hartree
pointgroup: C01 [X(C6H8O6)]
dipole: -0.0000046 -0.0002487 0.0000774 debye
dipolederiv: -0.8432843 0.1223795 -0.0282758 0.0914905 -0.4594254 0.0939264 -0.0253463 0.0872841 -0.4248057 -0.8433629 0.1223647 -0.028291 0.0914526 -0.4594213 0.0939151 -0.0253464 0.0872757 -0.4248045 -0.7607499 0.1364584 0.5517515 0.1305495 -0.416758 -0.0833764 0.4611677 -0.0824199 -0.7993452 -0.7607073 0.1362342 0.5517914 0.1303183 -0.4166539 -0.0831467 0.4612064 -0.0822344 -0.7994711 -0.699509 -0.0439408 -0.2099231 0.0046045 -0.3243697 -0.1171487 0.0269037 -0.1167443 -0.8676408 -0.6995132 -0.0438831 -0.2099487 0.0045392 -0.3242794 -0.1169813 0.0269497 -0.1164937 -0.8677344 0.0071099 -0.0674078 -0.0197268 -0.2956499 0.4642173 -0.033563 -0.0068769 0.0125404 0.2525427 0.0072245 -0.0673831 -0.0197279 -0.2955619 0.464239 -0.0335143 -0.0069447 0.0125753 0.2525199 0.6399873 -0.1256057 0.0829707 0.1510708 0.1861783 0.0347886 -0.0160951 0.0006435 0.2872539 0.6400504 -0.1256007 0.0829642 0.1511314 0.1861866 0.0347941 -0.0161536 0.0006319 0.287256 1.412475 -0.0456497 -0.2188235 -0.1392129 0.2319704 0.2487764 -0.2637102 0.2460118 1.3707276 1.4123923 -0.0454863 -0.2188414 -0.1389576 0.2317512 0.2483157 -0.2638001 0.2455183 1.3709819 0.0472116 -0.0046747 -0.0351017 0.0502905 -0.0335021 -0.028625 0.0123893 -0.0751967 -0.0878952 0.0472096 -0.004678 -0.0351056 0.0502865 -0.0334974 -0.028623 0.0123976 -0.0752006 -0.0878992 -0.0039388 0.0152046 -0.0099428 -0.0458556 0.0524218 -0.1112144 -0.0237488 -0.0350364 -0.079644 0.0231846 0.0465552 -0.0084103 0.0799924 -0.0892123 0.0335971 -0.018223 -0.0016649 0.0917916 0.0231763 0.0465583 -0.0084096 0.0799852 -0.0892124 0.0336011 -0.0182233 -0.0016654 0.0917919 -0.0039529 0.0152028 -0.009939 -0.0458543 0.05242 -0.1112169 -0.023747 -0.0350296 -0.0796489 0.1775041 -0.0333235 -0.1045061 -0.0273127 0.3884678 -0.0371682 -0.1464027 -0.0354142 0.2570165 0.1774928 -0.0333242 -0.1045046 -0.0273064 0.3884795 -0.0371366 -0.1463961 -0.0353811 0.2570067 unknown
polarizability: 110.7616131|-6.3399731|61.2605114|0.0281133|1.0084145|77.0342092 unknown
InChI: InChI=1S/C6H8O6/c7-5(8)3-1-11-4(2-12-3)6(9)10/h3-4,7,9H,1-2H2
charge 0 multiplicity 1
20 atoms
O  0.872547 1.077079 -0.388553
O  -0.872613 -1.077106 0.388668
O  3.689593 -0.42707 -0.925606
O  -3.689613 0.426506 0.925956
O  3.240211 0.070395 1.302099
O  -3.240339 -0.070039 -1.301974
C  1.375257 -0.312397 -0.277281
C  -1.375314 0.31238 0.277413
C  -0.548579 1.07805 -0.775206
C  0.548509 -1.078079 0.775328
C  2.833464 -0.189922 0.151893
C  -2.833536 0.189911 -0.151703
H  1.309811 -0.811615 -1.263482
H  -1.309827 0.811588 1.263618
H  -0.68758 0.606314 -1.76871
H  -0.830584 2.142456 -0.820914
H  0.830522 -2.142484 0.821025
H  0.687496 -0.606343 1.768835
H  4.636616 -0.322864 -0.632909
H  -4.636642 0.322237 0.633303
