program: Gaussian 09
title: 000243603
version: EM64L-G09RevD.01
frameworkgroup: C1[X(C6H8O6)]
method: RPBEPBE
basis: SDD
operation: Freq
keyword: #p
keyword: freq=noraman
keyword: PBEPBE/SDD
title: #p freq=noraman PBEPBE/SDD
converged: YES YES NO YES
title: Mulliken charges:
elementType: O O O O O O C C C C C C H H H H H H H H
charge: -0.239932 -0.239932 -0.422732 -0.422731 -0.206362 -0.206363 -0.158896 -0.158898 -0.313900 -0.313899 0.176064 0.176063 0.305412 0.305418 0.225898 0.245714 0.225898 0.245713 0.388733 0.388732
chargesum: 0.00000
title: Mulliken charges with hydrogens summed into heavy atoms:
elementType: O O O O O O C C C C C C
charge: -0.239932 -0.239932 -0.033999 -0.033999 -0.206362 -0.206363 0.146515 0.146520 0.157712 0.157712 0.176064 0.176063
polarizability: 8.94483907e+01 -3.82339875e-04 8.97757894e+01 2.76480021e+00 -1.74776385e-04 6.09113337e+01
1716.lowfreq: -4.3625 -0.0005 -0.0002 0.0005 9.3304 18.5862 51.0404 58.1279 84.3079
frequency: 51.0385 58.1000 84.3064 135.3383 173.4994 196.3194 282.5088 296.4824 344.7397 372.9261 393.8907 474.5082 488.7059 532.1680 553.6222 593.2817 619.3478 648.8986 655.6765 783.3475 798.3759 799.1065 841.3030 879.6243 942.5635 990.5730 1012.0842 1030.6815 1037.3749 1070.1217 1091.9145 1104.4121 1218.5968 1232.6696 1233.3458 1252.9789 1268.1566 1282.3480 1326.5623 1330.0824 1351.1934 1354.0121 1462.2627 1463.3003 1673.7436 1674.5474 3025.0548 3025.8213 3055.9039 3060.3416 3098.1754 3108.7740 3518.7326 3518.7401
redmass: 9.9480 10.5191 6.2802 6.1937 5.3598 4.2693 3.6605 6.3867 4.9597 5.9947 4.9024 4.0017 3.5198 2.8959 1.9702 3.0980 1.8867 2.0437 3.2942 3.3294 4.9377 3.1287 5.3495 3.6622 4.1874 3.2060 2.6311 2.8926 2.6213 4.2135 4.5600 2.1983 1.1742 1.2593 1.2950 1.2932 1.6438 1.5910 1.3314 1.5025 1.3187 1.2807 1.0886 1.0920 9.4892 9.6282 1.0566 1.0636 1.0837 1.0843 1.1036 1.1082 1.0644 1.0644
irintensity: 0.2298 1.6623 0.0098 0.1931 0.1923 10.6414 3.0224 9.3101 3.3915 2.0817 0.5868 32.1060 38.4495 0.5081 35.2696 100.8605 18.8383 165.1530 64.7100 10.5896 3.1063 35.8306 3.8386 3.1722 81.6910 105.9716 33.8461 35.7101 403.6184 26.0692 0.0019 6.4653 1.4557 18.5711 6.9553 2.0352 12.2345 33.4042 9.0800 11.0726 0.3379 2.2211 13.8799 12.3857 234.2173 194.7563 15.2788 43.6954 6.9606 5.3629 17.2439 18.8561 20.4067 37.9620
temp: 298.150 k
press: 1.00000 atm
elementType: 8 8 8 8 8 8 6 6 6 6 6 6 1 1 1 1 1 1 1 1
symmnumber: 1
zpe: 382040.5 jmol-1
zpe.correction: 0.145512 hartree
zpe.thermalcorrener: 0.156696 hartree
zpe.thermalcorrenthalpy: 0.157641 hartree
zpe.thermalcorrgfe: 0.107843 hartree
zpe.sumelectzpe: -683.823898 hartree
zpe.sumelectthermal: -683.812713 hartree
zpe.sumelectthermalent: -683.811769 hartree
zpe.sumelectthermalfe: -683.861567 hartree
dipole: 0.0000 -1.5061 0.0000
dipole: 1.5061
quadrupole: -71.5588 -58.3757 -72.4454
quadrupole: -0.0004 8.3936 0.0001
quadrupole: -4.0988 9.0842 -4.9854 -0.0004 8.3936 0.0001
hfenergy: -683.9694099 hartree
pointgroup: C01 [X(C6H8O6)]
dipole: 0.0000021 0.5925619 -0.0000163 debye
dipolederiv: -0.4885334 -0.0103221 -0.0519828 -0.0339791 -0.7880337 0.0080322 -0.0833704 0.0170447 -0.3755394 -0.4885402 0.0103339 -0.0519782 0.0339783 -0.7880427 -0.0080367 -0.0833762 -0.0170495 -0.375536 -0.3257781 -0.1646685 0.0203562 -0.1066027 -1.0662346 0.3444539 0.0249558 0.4025811 -0.5921909 -0.3257793 0.1646986 0.0203724 0.1066148 -1.0662817 -0.3444542 0.0249637 -0.4025149 -0.5921525 -0.8795132 0.2803427 -0.075648 0.1013097 -0.6635612 0.1812878 0.1346989 0.1099522 -0.3478297 -0.8795231 -0.2803534 -0.0756255 -0.101262 -0.6635773 -0.1812622 0.134656 -0.1099678 -0.3478242 0.0608997 0.0007061 0.0588073 0.1484557 0.4669373 -0.1331627 0.1301827 -0.2714808 0.184869 0.0609427 -0.0007141 0.0588005 -0.1484658 0.4669356 0.1331814 0.1302405 0.2714878 0.1848725 0.2715629 0.0184891 -0.0401695 -0.01179 0.4923456 0.0644404 -0.0083864 0.2002773 0.2218189 0.271577 -0.0184923 -0.0401726 0.0117878 0.4923511 -0.0644394 -0.0083845 -0.2002759 0.2218172 1.0965376 -0.1436956 -0.0554471 -0.0995608 1.2320499 -0.5171797 -0.3276186 -0.5085973 0.4812889 1.096558 0.1436627 -0.0554679 0.0994953 1.2321277 0.5171544 -0.3275853 0.5085395 0.4812245 0.1227219 -0.0172394 0.0056202 -0.0424409 -0.0137498 -0.0217399 0.0171019 -0.0518661 0.0625566 0.1227228 0.017246 0.0056151 0.0424487 -0.0137437 0.0217301 0.0170937 0.051862 0.062561 0.094947 -0.0261858 0.0137532 -0.0100785 -0.0683214 0.0713438 -0.0101124 0.1280148 -0.0052216 -0.064366 0.0551295 0.0497055 -0.0132785 0.0621669 -0.0275587 0.0706945 -0.0799197 0.0133637 0.0949459 0.0261858 0.0137536 0.0100788 -0.0683189 -0.0713431 -0.0101113 -0.1280145 -0.0052227 -0.0643697 -0.0551297 0.0497057 0.0132802 0.0621609 0.0275572 0.0706942 0.0799201 0.0133643 0.1114984 0.0157419 0.0750044 0.0733753 0.3463978 0.0087863 0.0518387 0.0215672 0.3568831 0.1114889 -0.0157354 0.0749975 -0.0733661 0.3463919 -0.0087909 0.0518246 -0.0215603 0.3568974 unknown
polarizability: 89.017311|-0.0004132|89.7757894|-4.4452262|-0.0000801|61.3424134 unknown
InChI: InChI=1S/C6H8O6/c7-5(8)3-4(6(9)10)12-2-1-11-3/h3-4,7,9H,1-2H2
charge 0 multiplicity 1
20 atoms
O  0.511623 -0.799962 1.344563
O  -0.511709 -0.799952 -1.344501
O  1.947017 1.852712 -0.791273
O  -1.947155 1.852767 0.791241
O  2.950887 -0.091924 -0.005354
O  -2.950998 -0.091896 0.005358
C  0.561776 0.413022 0.543699
C  -0.561866 0.413026 -0.543627
C  0.571443 -2.032351 0.509083
C  -0.571522 -2.03235 -0.509032
C  1.946052 0.637787 -0.091675
C  -1.946144 0.637781 0.091749
H  0.380883 1.24546 1.24544
H  -0.380973 1.245469 -1.245362
H  0.467682 -2.860344 1.228683
H  1.558088 -2.086358 0.015048
H  -0.467756 -2.860335 -1.22864
H  -1.558166 -2.086368 -0.014998
H  2.847621 2.015015 -1.182609
H  -2.847783 2.015102 1.182508
